{"text_format":"1","workbook":"xlsx","n_sheets":4,"sheets":["Dec","Results","print","nonscoring"],"not_rendered":{"charts":0,"images":0,"macros":1,"external_links":0,"defined_names":24,"comments":2,"pivot_tables":0},"unopened":[],"bounds":{"document_bytes":16777216,"sheet_cells":100000,"rows_first":2000,"rows_last":500,"rows_between":2000,"halvings":0,"cell_chars":16384,"cell_head_chars":4096},"cells_cut":0,"cells_raw":0,"read":"whole","date_system":"1900"}

{"sheet":"Dec","index":0,"n_rows":54,"n_cols":6,"rows_kept":54,"cut":false,"hidden":false,"merged":[]}
[null,"Sussex Under 13 League 2014 - East Division - Match 3 - 23.7.14"]
["Letter","Team"]
["B","Brighton & Hove",null,2]
["E","Eastbourne Rovers",null,3]
["H","Hastings",null,4]
["L","Lewes",null,5]
["P","Phoenix",null,6]
["Boys",{"$f":"$B$3","v":"Brighton & Hove"},{"$f":"$B$4","v":"Eastbourne Rovers"},{"$f":"$B$5","v":"Hastings"},{"$f":"$B$6","v":"Lewes"},{"$f":"$B$7","v":"Phoenix"}]
["75","Danny Ross-Horton","Joel Newton","-","Milton Thompson","Douglas Zveushe"]
["150","Jamie Arnold","Alex Field","-","Milton Thompson","Douglas Zveushe"]
["600","Jamie Arnold","James Ward","-","Atticus Dubouny","Alex Brothwell"]
["1000","Finn Halloren","William Napier","-","Jay Atkins","Jooel Luscombe"]
["75H","Finn Halloren","Joel Newton","-","Cassian Young","Remy Corder"]
["HJ","Luke McCallum","Joel Newton","-","Harry Reinicker Found","William Saunders"]
["LJ","Danny Ross-Horton","Dexter Scott","-","Harry Carr","William Saunders"]
["SP","Henry Davis","Huxley Pearce","-","Louis Soudain","Hector Blanchard"]
["DT","Marc Kenneally","-","-","Stephen Beasley","-"]
["JT","Henry Davis","Alex Field","-","Harry Carr","Joel Luscombe"]
["4x100",{"$f":"$B$3","v":"Brighton & Hove"},{"$f":"$B$4","v":"Eastbourne Rovers"},{"$f":"$B$5","v":"Hastings"},{"$f":"$B$6","v":"Lewes"},{"$f":"$B$7","v":"Phoenix"}]
[null,"B String","B String","B String","B String","B String"]
["75","Cameron Nash","Luc Crisp","-","Harry Carr","James Saunders"]
["150","Samuel Culbert","Huxley Pearce","-","Oliver Simonetti","Arthur Haines"]
["600","Adam Firsht","Dexter Scott","-","Louis Soudain","Eimhin Wellings"]
["1000","Lucas Losh","-","-","Sam Horn","Zach Elbourne"]
["75H","Adam Firsht","Luc Crisp","-","-","Hector Blanchard"]
["HJ","Lucas Losh","-","-","Jay Atkins","Zach Elbourne"]
["LJ","Cameron Nash","Luc Crisp","-","Harry Reinicker Found","Arthur Haines"]
["SP","Thomas Routledge","-","-","-","-"]
["DT","Thomas Routledge","-","-","-","-"]
["JT","Ben Neale","-","-","Stephen Beasley","-"]
[]
["Girls",{"$f":"$B$3","v":"Brighton & Hove"},{"$f":"$B$4","v":"Eastbourne Rovers"},{"$f":"$B$5","v":"Hastings"},{"$f":"$B$6","v":"Lewes"},{"$f":"$B$7","v":"Phoenix"}]
["75","Talusa Gascoine","Emma Logan","-","Eva Johnston Ellis","Naomi Owalobi"]
["150","Talusa Gascoine","Mia O'Hara","-","Hannah Williams","Francesca White"]
["600","Katie Mehel","Dafina Xhogu","-","Chloe Kornivall","Saoirse McGuiness"]
["1000","Niami Halloren","Louise Mariana-McIntyre","-","Eva Johnston Ellis","Rachel Berry"]
["70H","Florence Robinson","Beth Hawkins","-","-","Rachel Berry"]
["HJ","Katie Mehel","Emma Logan","-","Olivia Bartholomew","Connie Haines"]
["LJ","Anna Dornbusch","Mia O'Hara","-","Olivia Bartholomew","Francesca White"]
["SP","Anna Dornbusch","Louise Mariana-McIntyre","-","-","Naomi Owalobi"]
["DT","Mollie Kichenside","Nellie Hannam","-","Scarlett Bullen","Coleen Shaw"]
["JT","Florence Robinson","Beth Hawkins","-","Hannah Williams","Coleen Shaw"]
["4x100",{"$f":"$B$3","v":"Brighton & Hove"},{"$f":"$B$4","v":"Eastbourne Rovers"},{"$f":"$B$5","v":"Hastings"},{"$f":"$B$6","v":"Lewes"},{"$f":"$B$7","v":"Phoenix"}]
[null,"B String","B String","B String","B String","B String"]
["75","Lottie Wright","Emelia Davis","-","-","Connie Haines"]
["150","Verity Miller-Sarahs","Rose-Ella Peapell","-","Chloe Kornivall","Olivia Aung"]
["600","-","Chloe Eyres","-","Rosie Hobbs","Alanah Harding"]
["1000","-","Dafina Xhogu","-","Rosie Gainsford","-"]
["70H","-","-","-","-","Tegan Corder"]
["HJ","-","Chloe Morman","-","Rosie Hobbs","-"]
["LJ","Verity Miller-Sarahs","Molly Swingler","-","Isabella Williams","Ella Hodge"]
["SP","Mollie Kichenside","Caitlin Knight","-","-","Alanah Harding"]
["DT","Lottie Wright","Molly Swingler","-","-","Ella Hodge"]
["JT","Niamh Halloen","Nellie Hannam","-","Rosie Gainsford","Olivia Aung"]

{"sheet":"Results","index":1,"n_rows":261,"n_cols":16,"rows_kept":261,"cut":false,"hidden":false,"merged":[]}
[null,{"$f":"Dec!B1","v":"Sussex Under 13 League 2014 - East Division - Match 3 - 23.7.14"}]
[null,null,"Team","Score"]
[null,1,{"$f":"Dec!B3","v":"Brighton & Hove"},{"$f":"$H$261","v":169},"B"]
[null,2,{"$f":"Dec!B7","v":"Phoenix"},{"$f":"$L$261","v":125},"P"]
[null,3,{"$f":"Dec!B6","v":"Lewes"},{"$f":"$K$261","v":105.5},"L"]
[null,4,{"$f":"Dec!B4","v":"Eastbourne Rovers"},{"$f":"$I$261","v":104.5},"E"]
[null,5,{"$f":"Dec!B5","v":"Hastings"},{"$f":"$J$261","v":0},"H"]
[null,".",null,null,null,null,null,{"$f":"LEFT(Dec!B3,6)","v":"Bright"},{"$f":"LEFT(Dec!B4,6)","v":"Eastbo"},{"$f":"LEFT(Dec!B5,6)","v":"Hastin"},{"$f":"LEFT(Dec!B6,6)","v":"Lewes"},{"$f":"LEFT(Dec!B7,6)","v":"Phoeni"},"Waste"]
["75",null,"Boys' A 75m",null,null,null,null,{"$f":"Dec!A3","v":"B"},{"$f":"Dec!A4","v":"E"},{"$f":"Dec!A5","v":"H"},{"$f":"Dec!A6","v":"L"},{"$f":"Dec!A7","v":"P"},null,"75A"]
["B",1,{"$f":"IF(A10=\"\",\"\",VLOOKUP($A9,IF(LEN(A10)=2,MSB,MSA),VLOOKUP(LEFT(A10,1),Teams,4,FALSE),FALSE))","v":"Danny Ross-Horton"},{"$f":"IF(A10=\"\",\"\",VLOOKUP(LEFT(A10,1),Teams,2,FALSE))","v":"Brighton & Hove"},"10.8",5,null,{"$f":"IF($A10=\"\",\"\",IF(LEFT($A10,1)=H$9,$F10,\"\"))","v":5},"","","","",null,null,null,"100m"]
["E",2,{"$f":"IF(A11=\"\",\"\",VLOOKUP($A9,IF(LEN(A11)=2,MSB,MSA),VLOOKUP(LEFT(A11,1),Teams,4,FALSE),FALSE))","v":"Joel Newton"},{"$f":"IF(A11=\"\",\"\",VLOOKUP(LEFT(A11,1),Teams,2,FALSE))","v":"Eastbourne Rovers"},"11.1",4,null,"",4,"","","",null,null,null,"100m"]
["L","3",{"$f":"IF(A12=\"\",\"\",VLOOKUP($A9,IF(LEN(A12)=2,MSB,MSA),VLOOKUP(LEFT(A12,1),Teams,4,FALSE),FALSE))","v":"Milton Thompson"},{"$f":"IF(A12=\"\",\"\",VLOOKUP(LEFT(A12,1),Teams,2,FALSE))","v":"Lewes"},"11.2",3,null,"","","",3,""]
["P","4",{"$f":"IF(A13=\"\",\"\",VLOOKUP($A9,IF(LEN(A13)=2,MSB,MSA),VLOOKUP(LEFT(A13,1),Teams,4,FALSE),FALSE))","v":"Douglas Zveushe"},{"$f":"IF(A13=\"\",\"\",VLOOKUP(LEFT(A13,1),Teams,2,FALSE))","v":"Phoenix"},"11.2",2,null,"","","","",2,null,null,null,"100m"]
[null,"5",{"$f":"IF(A14=\"\",\"\",VLOOKUP($A9,IF(LEN(A14)=2,MSB,MSA),VLOOKUP(LEFT(A14,1),Teams,4,FALSE),FALSE))","v":""},{"$f":"IF(A14=\"\",\"\",VLOOKUP(LEFT(A14,1),Teams,2,FALSE))","v":""},null,1,null,"","","","","",{"$f":"15-SUM(H10:L14)","v":1},null,null,"100m"]
["75",null,"Boys' B 75m",null,null,null,null,null,null,null,null,null,null,"75B"]
["LL",1,{"$f":"IF(A16=\"\",\"\",VLOOKUP($A15,IF(LEN(A16)=2,MSB,MSA),VLOOKUP(LEFT(A16,1),Teams,4,FALSE),FALSE))","v":"Harry Carr"},{"$f":"IF(A16=\"\",\"\",VLOOKUP(LEFT(A16,1),Teams,2,FALSE))","v":"Lewes"},"11.3",5,null,{"$f":"IF($A16=\"\",\"\",IF(LEFT($A16,1)=H$9,$F16,\"\"))","v":""},"","",5,"",null,null,null,"100m"]
["BB",2,{"$f":"IF(A17=\"\",\"\",VLOOKUP($A15,IF(LEN(A17)=2,MSB,MSA),VLOOKUP(LEFT(A17,1),Teams,4,FALSE),FALSE))","v":"Cameron Nash"},{"$f":"IF(A17=\"\",\"\",VLOOKUP(LEFT(A17,1),Teams,2,FALSE))","v":"Brighton & Hove"},"11.6",4,null,4,"","","","",null,null,null,"100m"]
["PP","3",{"$f":"IF(A18=\"\",\"\",VLOOKUP($A15,IF(LEN(A18)=2,MSB,MSA),VLOOKUP(LEFT(A18,1),Teams,4,FALSE),FALSE))","v":"James Saunders"},{"$f":"IF(A18=\"\",\"\",VLOOKUP(LEFT(A18,1),Teams,2,FALSE))","v":"Phoenix"},"11.8",3,null,"","","","",3]
["EE","4",{"$f":"IF(A19=\"\",\"\",VLOOKUP($A15,IF(LEN(A19)=2,MSB,MSA),VLOOKUP(LEFT(A19,1),Teams,4,FALSE),FALSE))","v":"Luc Crisp"},{"$f":"IF(A19=\"\",\"\",VLOOKUP(LEFT(A19,1),Teams,2,FALSE))","v":"Eastbourne Rovers"},"12.0",2,null,"",2,"","","",null,null,null,"100m"]
[null,"5",{"$f":"IF(A20=\"\",\"\",VLOOKUP($A15,IF(LEN(A20)=2,MSB,MSA),VLOOKUP(LEFT(A20,1),Teams,4,FALSE),FALSE))","v":""},{"$f":"IF(A20=\"\",\"\",VLOOKUP(LEFT(A20,1),Teams,2,FALSE))","v":""},null,1,null,"","","","","",{"$f":"15-SUM(H16:L20)","v":1},null,null,"100m"]
["150",null,"Boys' A 150m",null,null,null,null,null,null,null,null,null,null,"150A"]
["E",1,{"$f":"IF(A22=\"\",\"\",VLOOKUP($A21,IF(LEN(A22)=2,MSB,MSA),VLOOKUP(LEFT(A22,1),Teams,4,FALSE),FALSE))","v":"Alex Field"},{"$f":"IF(A22=\"\",\"\",VLOOKUP(LEFT(A22,1),Teams,2,FALSE))","v":"Eastbourne Rovers"},"21.5",5,null,{"$f":"IF($A22=\"\",\"\",IF(LEFT($A22,1)=H$9,$F22,\"\"))","v":""},5,"","","",null,null,null,"200m"]
["B",2,{"$f":"IF(A23=\"\",\"\",VLOOKUP($A21,IF(LEN(A23)=2,MSB,MSA),VLOOKUP(LEFT(A23,1),Teams,4,FALSE),FALSE))","v":"Jamie Arnold"},{"$f":"IF(A23=\"\",\"\",VLOOKUP(LEFT(A23,1),Teams,2,FALSE))","v":"Brighton & Hove"},"21.8",4,null,4,"","","","",null,null,null,"200m"]
["L","3",{"$f":"IF(A24=\"\",\"\",VLOOKUP($A21,IF(LEN(A24)=2,MSB,MSA),VLOOKUP(LEFT(A24,1),Teams,4,FALSE),FALSE))","v":"Milton Thompson"},{"$f":"IF(A24=\"\",\"\",VLOOKUP(LEFT(A24,1),Teams,2,FALSE))","v":"Lewes"},"22.1",3,null,"","","",3,""]
["P","4",{"$f":"IF(A25=\"\",\"\",VLOOKUP($A21,IF(LEN(A25)=2,MSB,MSA),VLOOKUP(LEFT(A25,1),Teams,4,FALSE),FALSE))","v":"Douglas Zveushe"},{"$f":"IF(A25=\"\",\"\",VLOOKUP(LEFT(A25,1),Teams,2,FALSE))","v":"Phoenix"},"22.4",2,null,"","","","",2,null,null,null,"200m"]
[null,"5",{"$f":"IF(A26=\"\",\"\",VLOOKUP($A21,IF(LEN(A26)=2,MSB,MSA),VLOOKUP(LEFT(A26,1),Teams,4,FALSE),FALSE))","v":""},{"$f":"IF(A26=\"\",\"\",VLOOKUP(LEFT(A26,1),Teams,2,FALSE))","v":""},null,1,null,"","","","","",{"$f":"15-SUM(H22:L26)","v":1},null,null,"200m"]
["150",null,"Boys' B 150m",null,null,null,null,null,null,null,null,null,null,"150B"]
["LL",1,{"$f":"IF(A28=\"\",\"\",VLOOKUP($A27,IF(LEN(A28)=2,MSB,MSA),VLOOKUP(LEFT(A28,1),Teams,4,FALSE),FALSE))","v":"Oliver Simonetti"},{"$f":"IF(A28=\"\",\"\",VLOOKUP(LEFT(A28,1),Teams,2,FALSE))","v":"Lewes"},"22.2",5,null,{"$f":"IF($A28=\"\",\"\",IF(LEFT($A28,1)=H$9,$F28,\"\"))","v":""},"","",5,"",null,null,null,"200m"]
["PP",2,{"$f":"IF(A29=\"\",\"\",VLOOKUP($A27,IF(LEN(A29)=2,MSB,MSA),VLOOKUP(LEFT(A29,1),Teams,4,FALSE),FALSE))","v":"Arthur Haines"},{"$f":"IF(A29=\"\",\"\",VLOOKUP(LEFT(A29,1),Teams,2,FALSE))","v":"Phoenix"},"23.1",4,null,"","","","",4]
["BB","3",{"$f":"IF(A30=\"\",\"\",VLOOKUP($A27,IF(LEN(A30)=2,MSB,MSA),VLOOKUP(LEFT(A30,1),Teams,4,FALSE),FALSE))","v":"Samuel Culbert"},{"$f":"IF(A30=\"\",\"\",VLOOKUP(LEFT(A30,1),Teams,2,FALSE))","v":"Brighton & Hove"},"23.6",3,null,3,"","","","",null,null,null,"200m"]
["EE","4",{"$f":"IF(A31=\"\",\"\",VLOOKUP($A27,IF(LEN(A31)=2,MSB,MSA),VLOOKUP(LEFT(A31,1),Teams,4,FALSE),FALSE))","v":"Huxley Pearce"},{"$f":"IF(A31=\"\",\"\",VLOOKUP(LEFT(A31,1),Teams,2,FALSE))","v":"Eastbourne Rovers"},"23.8",2,null,"",2,"","","",null,null,null,"200m"]
[null,"5",{"$f":"IF(A32=\"\",\"\",VLOOKUP($A27,IF(LEN(A32)=2,MSB,MSA),VLOOKUP(LEFT(A32,1),Teams,4,FALSE),FALSE))","v":""},{"$f":"IF(A32=\"\",\"\",VLOOKUP(LEFT(A32,1),Teams,2,FALSE))","v":""},null,1,null,"","","","","",{"$f":"15-SUM(H28:L32)","v":1},null,null,"200m"]
["600",null,"Boys' A 600m",null,null,null,null,null,null,null,null,null,null,"600A"]
["B",1,{"$f":"IF(A34=\"\",\"\",VLOOKUP($A33,IF(LEN(A34)=2,MSB,MSA),VLOOKUP(LEFT(A34,1),Teams,4,FALSE),FALSE))","v":"Jamie Arnold"},{"$f":"IF(A34=\"\",\"\",VLOOKUP(LEFT(A34,1),Teams,2,FALSE))","v":"Brighton & Hove"},"1:48.2",5,null,{"$f":"IF($A34=\"\",\"\",IF(LEFT($A34,1)=H$9,$F34,\"\"))","v":5},"","","","",null,null,null,"400m"]
["P",2,{"$f":"IF(A35=\"\",\"\",VLOOKUP($A33,IF(LEN(A35)=2,MSB,MSA),VLOOKUP(LEFT(A35,1),Teams,4,FALSE),FALSE))","v":"Alex Brothwell"},{"$f":"IF(A35=\"\",\"\",VLOOKUP(LEFT(A35,1),Teams,2,FALSE))","v":"Phoenix"},"1:50.2",4,null,"","","","",4,null,null,null,"400m"]
["L","3",{"$f":"IF(A36=\"\",\"\",VLOOKUP($A33,IF(LEN(A36)=2,MSB,MSA),VLOOKUP(LEFT(A36,1),Teams,4,FALSE),FALSE))","v":"Atticus Dubouny"},{"$f":"IF(A36=\"\",\"\",VLOOKUP(LEFT(A36,1),Teams,2,FALSE))","v":"Lewes"},"1:55.0",3,null,"","","",3,""]
["E","4",{"$f":"IF(A37=\"\",\"\",VLOOKUP($A33,IF(LEN(A37)=2,MSB,MSA),VLOOKUP(LEFT(A37,1),Teams,4,FALSE),FALSE))","v":"James Ward"},{"$f":"IF(A37=\"\",\"\",VLOOKUP(LEFT(A37,1),Teams,2,FALSE))","v":"Eastbourne Rovers"},"2:07.0",2,null,"",2,"","","",null,null,null,"400m"]
[null,"5",{"$f":"IF(A38=\"\",\"\",VLOOKUP($A33,IF(LEN(A38)=2,MSB,MSA),VLOOKUP(LEFT(A38,1),Teams,4,FALSE),FALSE))","v":""},{"$f":"IF(A38=\"\",\"\",VLOOKUP(LEFT(A38,1),Teams,2,FALSE))","v":""},null,1,null,"","","","","",{"$f":"15-SUM(H34:L38)","v":1},null,null,"400m"]
["600",null,"Boys' B 600m",null,null,null,null,null,null,null,null,null,null,"600B"]
["BB",1,{"$f":"IF(A40=\"\",\"\",VLOOKUP($A39,IF(LEN(A40)=2,MSB,MSA),VLOOKUP(LEFT(A40,1),Teams,4,FALSE),FALSE))","v":"Adam Firsht"},{"$f":"IF(A40=\"\",\"\",VLOOKUP(LEFT(A40,1),Teams,2,FALSE))","v":"Brighton & Hove"},"1:50.4",5,null,{"$f":"IF($A40=\"\",\"\",IF(LEFT($A40,1)=H$9,$F40,\"\"))","v":5},"","","","",null,null,null,"400m"]
["PP",2,{"$f":"IF(A41=\"\",\"\",VLOOKUP($A39,IF(LEN(A41)=2,MSB,MSA),VLOOKUP(LEFT(A41,1),Teams,4,FALSE),FALSE))","v":"Eimhin Wellings"},{"$f":"IF(A41=\"\",\"\",VLOOKUP(LEFT(A41,1),Teams,2,FALSE))","v":"Phoenix"},"2:01.1",4,null,"","","","",4,null,null,null,"400m"]
["EE","3",{"$f":"IF(A42=\"\",\"\",VLOOKUP($A39,IF(LEN(A42)=2,MSB,MSA),VLOOKUP(LEFT(A42,1),Teams,4,FALSE),FALSE))","v":"Dexter Scott"},{"$f":"IF(A42=\"\",\"\",VLOOKUP(LEFT(A42,1),Teams,2,FALSE))","v":"Eastbourne Rovers"},"2:10.9",3,null,"",3,"","",""]
["LL","4",{"$f":"IF(A43=\"\",\"\",VLOOKUP($A39,IF(LEN(A43)=2,MSB,MSA),VLOOKUP(LEFT(A43,1),Teams,4,FALSE),FALSE))","v":"Louis Soudain"},{"$f":"IF(A43=\"\",\"\",VLOOKUP(LEFT(A43,1),Teams,2,FALSE))","v":"Lewes"},"2:13.0",2,null,"","","",2,"",null,null,null,"400m"]
[null,"5",{"$f":"IF(A44=\"\",\"\",VLOOKUP($A39,IF(LEN(A44)=2,MSB,MSA),VLOOKUP(LEFT(A44,1),Teams,4,FALSE),FALSE))","v":""},{"$f":"IF(A44=\"\",\"\",VLOOKUP(LEFT(A44,1),Teams,2,FALSE))","v":""},null,1,null,"","","","","",{"$f":"15-SUM(H40:L44)","v":1},null,null,"400m"]
["1000",null,"Boys' A 1000m",null,null,null,null,null,null,null,null,null,null,"1000A"]
["B",1,{"$f":"IF(A46=\"\",\"\",VLOOKUP($A45,IF(LEN(A46)=2,MSB,MSA),VLOOKUP(LEFT(A46,1),Teams,4,FALSE),FALSE))","v":"Finn Halloren"},{"$f":"IF(A46=\"\",\"\",VLOOKUP(LEFT(A46,1),Teams,2,FALSE))","v":"Brighton & Hove"},"3:13.3",5,null,{"$f":"IF($A46=\"\",\"\",IF(LEFT($A46,1)=H$9,$F46,\"\"))","v":5},"","","","",null,null,null,"800m"]
["P",2,{"$f":"IF(A47=\"\",\"\",VLOOKUP($A45,IF(LEN(A47)=2,MSB,MSA),VLOOKUP(LEFT(A47,1),Teams,4,FALSE),FALSE))","v":"Jooel Luscombe"},{"$f":"IF(A47=\"\",\"\",VLOOKUP(LEFT(A47,1),Teams,2,FALSE))","v":"Phoenix"},"3:22.9",4,null,"","","","",4,null,null,null,"800m"]
["L","3",{"$f":"IF(A48=\"\",\"\",VLOOKUP($A45,IF(LEN(A48)=2,MSB,MSA),VLOOKUP(LEFT(A48,1),Teams,4,FALSE),FALSE))","v":"Jay Atkins"},{"$f":"IF(A48=\"\",\"\",VLOOKUP(LEFT(A48,1),Teams,2,FALSE))","v":"Lewes"},"3:28.8",3,null,"","","",3,""]
["E","4",{"$f":"IF(A49=\"\",\"\",VLOOKUP($A45,IF(LEN(A49)=2,MSB,MSA),VLOOKUP(LEFT(A49,1),Teams,4,FALSE),FALSE))","v":"William Napier"},{"$f":"IF(A49=\"\",\"\",VLOOKUP(LEFT(A49,1),Teams,2,FALSE))","v":"Eastbourne Rovers"},"3:49.3",2,null,"",2,"","","",null,null,null,"800m"]
[null,"5",{"$f":"IF(A50=\"\",\"\",VLOOKUP($A45,IF(LEN(A50)=2,MSB,MSA),VLOOKUP(LEFT(A50,1),Teams,4,FALSE),FALSE))","v":""},{"$f":"IF(A50=\"\",\"\",VLOOKUP(LEFT(A50,1),Teams,2,FALSE))","v":""},null,1,null,"","","","","",{"$f":"15-SUM(H46:L50)","v":1},null,null,"800m"]
["1000",null,"Boys' B 1000m",null,null,null,null,null,null,null,null,null,null,"1000B"]
["BB","1",{"$f":"IF(A52=\"\",\"\",VLOOKUP($A51,IF(LEN(A52)=2,MSB,MSA),VLOOKUP(LEFT(A52,1),Teams,4,FALSE),FALSE))","v":"Lucas Losh"},{"$f":"IF(A52=\"\",\"\",VLOOKUP(LEFT(A52,1),Teams,2,FALSE))","v":"Brighton & Hove"},"3:28.4",5,null,{"$f":"IF($A52=\"\",\"\",IF(LEFT($A52,1)=H$9,$F52,\"\"))","v":5},"","","","",null,null,null,"800m"]
["LL","2",{"$f":"IF(A53=\"\",\"\",VLOOKUP($A51,IF(LEN(A53)=2,MSB,MSA),VLOOKUP(LEFT(A53,1),Teams,4,FALSE),FALSE))","v":"Sam Horn"},{"$f":"IF(A53=\"\",\"\",VLOOKUP(LEFT(A53,1),Teams,2,FALSE))","v":"Lewes"},"3:32.1",4,null,"","","",4,"",null,null,null,"800m"]
["PP","3",{"$f":"IF(A54=\"\",\"\",VLOOKUP($A51,IF(LEN(A54)=2,MSB,MSA),VLOOKUP(LEFT(A54,1),Teams,4,FALSE),FALSE))","v":"Zach Elbourne"},{"$f":"IF(A54=\"\",\"\",VLOOKUP(LEFT(A54,1),Teams,2,FALSE))","v":"Phoenix"},"3:33.9",3,null,"","","","",3]
[null,"4",{"$f":"IF(A55=\"\",\"\",VLOOKUP($A51,IF(LEN(A55)=2,MSB,MSA),VLOOKUP(LEFT(A55,1),Teams,4,FALSE),FALSE))","v":""},{"$f":"IF(A55=\"\",\"\",VLOOKUP(LEFT(A55,1),Teams,2,FALSE))","v":""},null,2,null,"","","","","",null,null,null,"800m"]
[null,"5",{"$f":"IF(A56=\"\",\"\",VLOOKUP($A51,IF(LEN(A56)=2,MSB,MSA),VLOOKUP(LEFT(A56,1),Teams,4,FALSE),FALSE))","v":""},{"$f":"IF(A56=\"\",\"\",VLOOKUP(LEFT(A56,1),Teams,2,FALSE))","v":""},null,1,null,"","","","","",{"$f":"15-SUM(H52:L56)","v":3},null,null,"800m"]
["75H",null,"Boys' A 75mH",null,null,null,null,null,null,null,null,null,null,"110HA"]
["B","1",{"$f":"IF(A58=\"\",\"\",VLOOKUP($A57,IF(LEN(A58)=2,MSB,MSA),VLOOKUP(LEFT(A58,1),Teams,4,FALSE),FALSE))","v":"Finn Halloren"},{"$f":"IF(A58=\"\",\"\",VLOOKUP(LEFT(A58,1),Teams,2,FALSE))","v":"Brighton & Hove"},"14.4",5,null,{"$f":"IF($A58=\"\",\"\",IF(LEFT($A58,1)=H$9,$F58,\"\"))","v":5},"","","","",null,null,null,"110mH"]
["P","2",{"$f":"IF(A59=\"\",\"\",VLOOKUP($A57,IF(LEN(A59)=2,MSB,MSA),VLOOKUP(LEFT(A59,1),Teams,4,FALSE),FALSE))","v":"Remy Corder"},{"$f":"IF(A59=\"\",\"\",VLOOKUP(LEFT(A59,1),Teams,2,FALSE))","v":"Phoenix"},"14.7",4,null,"","","","",4,null,null,null,"110mH"]
["L","3",{"$f":"IF(A60=\"\",\"\",VLOOKUP($A57,IF(LEN(A60)=2,MSB,MSA),VLOOKUP(LEFT(A60,1),Teams,4,FALSE),FALSE))","v":"Cassian Young"},{"$f":"IF(A60=\"\",\"\",VLOOKUP(LEFT(A60,1),Teams,2,FALSE))","v":"Lewes"},"16.0",3,null,"","","",3,""]
[null,"4",{"$f":"IF(A61=\"\",\"\",VLOOKUP($A57,IF(LEN(A61)=2,MSB,MSA),VLOOKUP(LEFT(A61,1),Teams,4,FALSE),FALSE))","v":""},{"$f":"IF(A61=\"\",\"\",VLOOKUP(LEFT(A61,1),Teams,2,FALSE))","v":""},null,2,null,"","","","","",null,null,null,"110mH"]
[null,"5",{"$f":"IF(A62=\"\",\"\",VLOOKUP($A57,IF(LEN(A62)=2,MSB,MSA),VLOOKUP(LEFT(A62,1),Teams,4,FALSE),FALSE))","v":""},{"$f":"IF(A62=\"\",\"\",VLOOKUP(LEFT(A62,1),Teams,2,FALSE))","v":""},null,1,null,"","","","","",{"$f":"15-SUM(H58:L62)","v":3},null,null,"110mH"]
["75H",null,"Boys' B 75mH",null,null,null,null,null,null,null,null,null,null,"110HB"]
["BB","1",{"$f":"IF(A64=\"\",\"\",VLOOKUP($A63,IF(LEN(A64)=2,MSB,MSA),VLOOKUP(LEFT(A64,1),Teams,4,FALSE),FALSE))","v":"Adam Firsht"},{"$f":"IF(A64=\"\",\"\",VLOOKUP(LEFT(A64,1),Teams,2,FALSE))","v":"Brighton & Hove"},"15.6",5,null,{"$f":"IF($A64=\"\",\"\",IF(LEFT($A64,1)=H$9,$F64,\"\"))","v":5},"","","","",null,null,null,"110mH"]
["PP","2",{"$f":"IF(A65=\"\",\"\",VLOOKUP($A63,IF(LEN(A65)=2,MSB,MSA),VLOOKUP(LEFT(A65,1),Teams,4,FALSE),FALSE))","v":"Hector Blanchard"},{"$f":"IF(A65=\"\",\"\",VLOOKUP(LEFT(A65,1),Teams,2,FALSE))","v":"Phoenix"},"15.7",4,null,"","","","",4,null,null,null,"110mH"]
[null,"3",{"$f":"IF(A66=\"\",\"\",VLOOKUP($A63,IF(LEN(A66)=2,MSB,MSA),VLOOKUP(LEFT(A66,1),Teams,4,FALSE),FALSE))","v":""},{"$f":"IF(A66=\"\",\"\",VLOOKUP(LEFT(A66,1),Teams,2,FALSE))","v":""},null,3,null,"","","","",""]
[null,"4",{"$f":"IF(A67=\"\",\"\",VLOOKUP($A63,IF(LEN(A67)=2,MSB,MSA),VLOOKUP(LEFT(A67,1),Teams,4,FALSE),FALSE))","v":""},{"$f":"IF(A67=\"\",\"\",VLOOKUP(LEFT(A67,1),Teams,2,FALSE))","v":""},null,2,null,"","","","","",null,null,null,"110mH"]
[null,"5",{"$f":"IF(A68=\"\",\"\",VLOOKUP($A63,IF(LEN(A68)=2,MSB,MSA),VLOOKUP(LEFT(A68,1),Teams,4,FALSE),FALSE))","v":""},{"$f":"IF(A68=\"\",\"\",VLOOKUP(LEFT(A68,1),Teams,2,FALSE))","v":""},null,1,null,"","","","","",{"$f":"15-SUM(H64:L68)","v":6},null,null,"110mH"]
["HJ",null,"Boys' A High Jump",null,null,null,null,null,null,null,null,null,null,"HJA"]
["L","1",{"$f":"IF(A70=\"\",\"\",VLOOKUP($A69,IF(LEN(A70)=2,MSB,MSA),VLOOKUP(LEFT(A70,1),Teams,4,FALSE),FALSE))","v":"Harry Reinicker Found"},{"$f":"IF(A70=\"\",\"\",VLOOKUP(LEFT(A70,1),Teams,2,FALSE))","v":"Lewes"},"1.47",5,null,{"$f":"IF($A70=\"\",\"\",IF(LEFT($A70,1)=H$9,$F70,\"\"))","v":""},"","",5,"",null,null,null,"High Jump"]
["P","2",{"$f":"IF(A71=\"\",\"\",VLOOKUP($A69,IF(LEN(A71)=2,MSB,MSA),VLOOKUP(LEFT(A71,1),Teams,4,FALSE),FALSE))","v":"William Saunders"},{"$f":"IF(A71=\"\",\"\",VLOOKUP(LEFT(A71,1),Teams,2,FALSE))","v":"Phoenix"},"1.44",4,null,"","","","",4,null,null,null,"High Jump"]
["B","3=",{"$f":"IF(A72=\"\",\"\",VLOOKUP($A69,IF(LEN(A72)=2,MSB,MSA),VLOOKUP(LEFT(A72,1),Teams,4,FALSE),FALSE))","v":"Luke McCallum"},{"$f":"IF(A72=\"\",\"\",VLOOKUP(LEFT(A72,1),Teams,2,FALSE))","v":"Brighton & Hove"},"1.2",2.5,null,2.5,"","","",""]
["E","3=",{"$f":"IF(A73=\"\",\"\",VLOOKUP($A69,IF(LEN(A73)=2,MSB,MSA),VLOOKUP(LEFT(A73,1),Teams,4,FALSE),FALSE))","v":"Joel Newton"},{"$f":"IF(A73=\"\",\"\",VLOOKUP(LEFT(A73,1),Teams,2,FALSE))","v":"Eastbourne Rovers"},"1.2",2.5,null,"",2.5,"","","",null,null,null,"High Jump"]
[null,"5",{"$f":"IF(A74=\"\",\"\",VLOOKUP($A69,IF(LEN(A74)=2,MSB,MSA),VLOOKUP(LEFT(A74,1),Teams,4,FALSE),FALSE))","v":""},{"$f":"IF(A74=\"\",\"\",VLOOKUP(LEFT(A74,1),Teams,2,FALSE))","v":""},null,1,null,"","","","","",{"$f":"15-SUM(H70:L74)","v":1},null,null,"High Jump"]
["HJ",null,"Boys' B High Jump",null,null,null,null,null,null,null,null,null,null,"HJB"]
["LL","1",{"$f":"IF(A76=\"\",\"\",VLOOKUP($A75,IF(LEN(A76)=2,MSB,MSA),VLOOKUP(LEFT(A76,1),Teams,4,FALSE),FALSE))","v":"Jay Atkins"},{"$f":"IF(A76=\"\",\"\",VLOOKUP(LEFT(A76,1),Teams,2,FALSE))","v":"Lewes"},"1.25",5,null,{"$f":"IF($A76=\"\",\"\",IF(LEFT($A76,1)=H$9,$F76,\"\"))","v":""},"","",5,"",null,null,null,"High Jump"]
["PP","2",{"$f":"IF(A77=\"\",\"\",VLOOKUP($A75,IF(LEN(A77)=2,MSB,MSA),VLOOKUP(LEFT(A77,1),Teams,4,FALSE),FALSE))","v":"Zach Elbourne"},{"$f":"IF(A77=\"\",\"\",VLOOKUP(LEFT(A77,1),Teams,2,FALSE))","v":"Phoenix"},"1.15",4,null,"","","","",4,null,null,null,"High Jump"]
["BB","3",{"$f":"IF(A78=\"\",\"\",VLOOKUP($A75,IF(LEN(A78)=2,MSB,MSA),VLOOKUP(LEFT(A78,1),Teams,4,FALSE),FALSE))","v":"Lucas Losh"},{"$f":"IF(A78=\"\",\"\",VLOOKUP(LEFT(A78,1),Teams,2,FALSE))","v":"Brighton & Hove"},"1.15",3,null,3,"","","",""]
[null,"4",{"$f":"IF(A79=\"\",\"\",VLOOKUP($A75,IF(LEN(A79)=2,MSB,MSA),VLOOKUP(LEFT(A79,1),Teams,4,FALSE),FALSE))","v":""},{"$f":"IF(A79=\"\",\"\",VLOOKUP(LEFT(A79,1),Teams,2,FALSE))","v":""},null,2,null,"","","","","",null,null,null,"High Jump"]
[null,"5",{"$f":"IF(A80=\"\",\"\",VLOOKUP($A75,IF(LEN(A80)=2,MSB,MSA),VLOOKUP(LEFT(A80,1),Teams,4,FALSE),FALSE))","v":""},{"$f":"IF(A80=\"\",\"\",VLOOKUP(LEFT(A80,1),Teams,2,FALSE))","v":""},null,1,null,"","","","","",{"$f":"15-SUM(H76:L80)","v":3},null,null,"High Jump"]
["LJ",null,"Boys' A Long Jump",null,null,null,null,null,null,null,null,null,null,"LJA"]
["P","1",{"$f":"IF(A82=\"\",\"\",VLOOKUP($A81,IF(LEN(A82)=2,MSB,MSA),VLOOKUP(LEFT(A82,1),Teams,4,FALSE),FALSE))","v":"William Saunders"},{"$f":"IF(A82=\"\",\"\",VLOOKUP(LEFT(A82,1),Teams,2,FALSE))","v":"Phoenix"},"4.56",5,null,{"$f":"IF($A82=\"\",\"\",IF(LEFT($A82,1)=H$9,$F82,\"\"))","v":""},"","","",5,null,null,null,"Long Jump"]
["B","2",{"$f":"IF(A83=\"\",\"\",VLOOKUP($A81,IF(LEN(A83)=2,MSB,MSA),VLOOKUP(LEFT(A83,1),Teams,4,FALSE),FALSE))","v":"Danny Ross-Horton"},{"$f":"IF(A83=\"\",\"\",VLOOKUP(LEFT(A83,1),Teams,2,FALSE))","v":"Brighton & Hove"},"4.27",4,null,4,"","","","",null,null,null,"Long Jump"]
["LL","3",{"$f":"IF(A84=\"\",\"\",VLOOKUP($A81,IF(LEN(A84)=2,MSB,MSA),VLOOKUP(LEFT(A84,1),Teams,4,FALSE),FALSE))","v":"Harry Reinicker Found"},{"$f":"IF(A84=\"\",\"\",VLOOKUP(LEFT(A84,1),Teams,2,FALSE))","v":"Lewes"},"3.78",3,null,"","","",3,""]
["EE","4",{"$f":"IF(A85=\"\",\"\",VLOOKUP($A81,IF(LEN(A85)=2,MSB,MSA),VLOOKUP(LEFT(A85,1),Teams,4,FALSE),FALSE))","v":"Luc Crisp"},{"$f":"IF(A85=\"\",\"\",VLOOKUP(LEFT(A85,1),Teams,2,FALSE))","v":"Eastbourne Rovers"},"3.50",2,null,"",2,"","","",null,null,null,"Long Jump"]
[null,"5",{"$f":"IF(A86=\"\",\"\",VLOOKUP($A81,IF(LEN(A86)=2,MSB,MSA),VLOOKUP(LEFT(A86,1),Teams,4,FALSE),FALSE))","v":""},{"$f":"IF(A86=\"\",\"\",VLOOKUP(LEFT(A86,1),Teams,2,FALSE))","v":""},null,1,null,"","","","","",{"$f":"15-SUM(H82:L86)","v":1},null,null,"Long Jump"]
["LJ",null,"Boys' B Long Jump",null,null,null,null,null,null,null,null,null,null,"LJB"]
["PP","1",{"$f":"IF(A88=\"\",\"\",VLOOKUP($A87,IF(LEN(A88)=2,MSB,MSA),VLOOKUP(LEFT(A88,1),Teams,4,FALSE),FALSE))","v":"Arthur Haines"},{"$f":"IF(A88=\"\",\"\",VLOOKUP(LEFT(A88,1),Teams,2,FALSE))","v":"Phoenix"},"4.08",5,null,{"$f":"IF($A88=\"\",\"\",IF(LEFT($A88,1)=H$9,$F88,\"\"))","v":""},"","","",5,null,null,null,"Long Jump"]
["BB","2",{"$f":"IF(A89=\"\",\"\",VLOOKUP($A87,IF(LEN(A89)=2,MSB,MSA),VLOOKUP(LEFT(A89,1),Teams,4,FALSE),FALSE))","v":"Cameron Nash"},{"$f":"IF(A89=\"\",\"\",VLOOKUP(LEFT(A89,1),Teams,2,FALSE))","v":"Brighton & Hove"},"4.03",4,null,4,"","","","",null,null,null,"Long Jump"]
["L","3",{"$f":"IF(A90=\"\",\"\",VLOOKUP($A87,IF(LEN(A90)=2,MSB,MSA),VLOOKUP(LEFT(A90,1),Teams,4,FALSE),FALSE))","v":"Harry Carr"},{"$f":"IF(A90=\"\",\"\",VLOOKUP(LEFT(A90,1),Teams,2,FALSE))","v":"Lewes"},"3.59",3,null,"","","",3,""]
["E","4",{"$f":"IF(A91=\"\",\"\",VLOOKUP($A87,IF(LEN(A91)=2,MSB,MSA),VLOOKUP(LEFT(A91,1),Teams,4,FALSE),FALSE))","v":"Dexter Scott"},{"$f":"IF(A91=\"\",\"\",VLOOKUP(LEFT(A91,1),Teams,2,FALSE))","v":"Eastbourne Rovers"},"3.37",2,null,"",2,"","","",null,null,null,"Long Jump"]
[null,"5",{"$f":"IF(A92=\"\",\"\",VLOOKUP($A87,IF(LEN(A92)=2,MSB,MSA),VLOOKUP(LEFT(A92,1),Teams,4,FALSE),FALSE))","v":""},{"$f":"IF(A92=\"\",\"\",VLOOKUP(LEFT(A92,1),Teams,2,FALSE))","v":""},null,1,null,"","","","","",{"$f":"15-SUM(H88:L92)","v":1},null,null,"Long Jump"]
["SP",null,"Boys' A Shot Putt",null,null,null,null,null,null,null,null,null,null,"SPA"]
["B","1",{"$f":"IF(A94=\"\",\"\",VLOOKUP($A93,IF(LEN(A94)=2,MSB,MSA),VLOOKUP(LEFT(A94,1),Teams,4,FALSE),FALSE))","v":"Henry Davis"},{"$f":"IF(A94=\"\",\"\",VLOOKUP(LEFT(A94,1),Teams,2,FALSE))","v":"Brighton & Hove"},"6.24",5,null,{"$f":"IF($A94=\"\",\"\",IF(LEFT($A94,1)=H$9,$F94,\"\"))","v":5},"","","","",null,null,null,"Shot"]
["E","2",{"$f":"IF(A95=\"\",\"\",VLOOKUP($A93,IF(LEN(A95)=2,MSB,MSA),VLOOKUP(LEFT(A95,1),Teams,4,FALSE),FALSE))","v":"Huxley Pearce"},{"$f":"IF(A95=\"\",\"\",VLOOKUP(LEFT(A95,1),Teams,2,FALSE))","v":"Eastbourne Rovers"},"5.78",4,null,"",4,"","","",null,null,null,"Shot"]
["P","3",{"$f":"IF(A96=\"\",\"\",VLOOKUP($A93,IF(LEN(A96)=2,MSB,MSA),VLOOKUP(LEFT(A96,1),Teams,4,FALSE),FALSE))","v":"Hector Blanchard"},{"$f":"IF(A96=\"\",\"\",VLOOKUP(LEFT(A96,1),Teams,2,FALSE))","v":"Phoenix"},"5.29",3,null,"","","","",3]
["L","4",{"$f":"IF(A97=\"\",\"\",VLOOKUP($A93,IF(LEN(A97)=2,MSB,MSA),VLOOKUP(LEFT(A97,1),Teams,4,FALSE),FALSE))","v":"Louis Soudain"},{"$f":"IF(A97=\"\",\"\",VLOOKUP(LEFT(A97,1),Teams,2,FALSE))","v":"Lewes"},"4.31",2,null,"","","",2,"",null,null,null,"Shot"]
[null,"5",{"$f":"IF(A98=\"\",\"\",VLOOKUP($A93,IF(LEN(A98)=2,MSB,MSA),VLOOKUP(LEFT(A98,1),Teams,4,FALSE),FALSE))","v":""},{"$f":"IF(A98=\"\",\"\",VLOOKUP(LEFT(A98,1),Teams,2,FALSE))","v":""},null,1,null,"","","","","",{"$f":"15-SUM(H94:L98)","v":1},null,null,"Shot"]
["SP",null,"Boys' B Shot Putt",null,null,null,null,null,null,null,null,null,null,"SPB"]
["BB","1",{"$f":"IF(A100=\"\",\"\",VLOOKUP($A99,IF(LEN(A100)=2,MSB,MSA),VLOOKUP(LEFT(A100,1),Teams,4,FALSE),FALSE))","v":"Thomas Routledge"},{"$f":"IF(A100=\"\",\"\",VLOOKUP(LEFT(A100,1),Teams,2,FALSE))","v":"Brighton & Hove"},"6.17",5,null,{"$f":"IF($A100=\"\",\"\",IF(LEFT($A100,1)=H$9,$F100,\"\"))","v":5},"","","","",null,null,null,"Shot"]
[null,"2",{"$f":"IF(A101=\"\",\"\",VLOOKUP($A99,IF(LEN(A101)=2,MSB,MSA),VLOOKUP(LEFT(A101,1),Teams,4,FALSE),FALSE))","v":""},{"$f":"IF(A101=\"\",\"\",VLOOKUP(LEFT(A101,1),Teams,2,FALSE))","v":""},null,4,null,"","","","","",null,null,null,"Shot"]
[null,"3",{"$f":"IF(A102=\"\",\"\",VLOOKUP($A99,IF(LEN(A102)=2,MSB,MSA),VLOOKUP(LEFT(A102,1),Teams,4,FALSE),FALSE))","v":""},{"$f":"IF(A102=\"\",\"\",VLOOKUP(LEFT(A102,1),Teams,2,FALSE))","v":""},null,3,null,"","","","",""]
[null,"4",{"$f":"IF(A103=\"\",\"\",VLOOKUP($A99,IF(LEN(A103)=2,MSB,MSA),VLOOKUP(LEFT(A103,1),Teams,4,FALSE),FALSE))","v":""},{"$f":"IF(A103=\"\",\"\",VLOOKUP(LEFT(A103,1),Teams,2,FALSE))","v":""},null,2,null,"","","","","",null,null,null,"Shot"]
[null,"5",{"$f":"IF(A104=\"\",\"\",VLOOKUP($A99,IF(LEN(A104)=2,MSB,MSA),VLOOKUP(LEFT(A104,1),Teams,4,FALSE),FALSE))","v":""},{"$f":"IF(A104=\"\",\"\",VLOOKUP(LEFT(A104,1),Teams,2,FALSE))","v":""},null,1,null,"","","","","",{"$f":"15-SUM(H100:L104)","v":10},null,null,"Shot"]
["DT",null,"Boys' A Discus",null,null,null,null,null,null,null,null,null,null,"DTA"]
["BB","1",{"$f":"IF(A106=\"\",\"\",VLOOKUP($A105,IF(LEN(A106)=2,MSB,MSA),VLOOKUP(LEFT(A106,1),Teams,4,FALSE),FALSE))","v":"Thomas Routledge"},{"$f":"IF(A106=\"\",\"\",VLOOKUP(LEFT(A106,1),Teams,2,FALSE))","v":"Brighton & Hove"},"14.99",5,null,{"$f":"IF($A106=\"\",\"\",IF(LEFT($A106,1)=H$9,$F106,\"\"))","v":5},"","","","",null,null,null,"Discus"]
[null,"2",{"$f":"IF(A107=\"\",\"\",VLOOKUP($A105,IF(LEN(A107)=2,MSB,MSA),VLOOKUP(LEFT(A107,1),Teams,4,FALSE),FALSE))","v":""},{"$f":"IF(A107=\"\",\"\",VLOOKUP(LEFT(A107,1),Teams,2,FALSE))","v":""},null,4,null,"","","","","",null,null,null,"Discus"]
[null,"3",{"$f":"IF(A108=\"\",\"\",VLOOKUP($A105,IF(LEN(A108)=2,MSB,MSA),VLOOKUP(LEFT(A108,1),Teams,4,FALSE),FALSE))","v":""},{"$f":"IF(A108=\"\",\"\",VLOOKUP(LEFT(A108,1),Teams,2,FALSE))","v":""},null,3,null,"","","","",""]
[null,"4",{"$f":"IF(A109=\"\",\"\",VLOOKUP($A105,IF(LEN(A109)=2,MSB,MSA),VLOOKUP(LEFT(A109,1),Teams,4,FALSE),FALSE))","v":""},{"$f":"IF(A109=\"\",\"\",VLOOKUP(LEFT(A109,1),Teams,2,FALSE))","v":""},null,2,null,"","","","","",null,null,null,"Discus"]
[null,"5",{"$f":"IF(A110=\"\",\"\",VLOOKUP($A105,IF(LEN(A110)=2,MSB,MSA),VLOOKUP(LEFT(A110,1),Teams,4,FALSE),FALSE))","v":""},{"$f":"IF(A110=\"\",\"\",VLOOKUP(LEFT(A110,1),Teams,2,FALSE))","v":""},null,1,null,"","","","","",{"$f":"15-SUM(H106:L110)","v":10},null,null,"Discus"]
["DT",null,"Boys' B Discus",null,null,null,null,null,null,null,null,null,null,"DTB"]
["B","1",{"$f":"IF(A112=\"\",\"\",VLOOKUP($A111,IF(LEN(A112)=2,MSB,MSA),VLOOKUP(LEFT(A112,1),Teams,4,FALSE),FALSE))","v":"Marc Kenneally"},{"$f":"IF(A112=\"\",\"\",VLOOKUP(LEFT(A112,1),Teams,2,FALSE))","v":"Brighton & Hove"},"13.58",5,null,{"$f":"IF($A112=\"\",\"\",IF(LEFT($A112,1)=H$9,$F112,\"\"))","v":5},"","","","",null,null,null,"Discus"]
[null,"2",{"$f":"IF(A113=\"\",\"\",VLOOKUP($A111,IF(LEN(A113)=2,MSB,MSA),VLOOKUP(LEFT(A113,1),Teams,4,FALSE),FALSE))","v":""},{"$f":"IF(A113=\"\",\"\",VLOOKUP(LEFT(A113,1),Teams,2,FALSE))","v":""},null,4,null,"","","","","",null,null,null,"Discus"]
[null,"3",{"$f":"IF(A114=\"\",\"\",VLOOKUP($A111,IF(LEN(A114)=2,MSB,MSA),VLOOKUP(LEFT(A114,1),Teams,4,FALSE),FALSE))","v":""},{"$f":"IF(A114=\"\",\"\",VLOOKUP(LEFT(A114,1),Teams,2,FALSE))","v":""},null,3,null,"","","","",""]
[null,"4",{"$f":"IF(A115=\"\",\"\",VLOOKUP($A111,IF(LEN(A115)=2,MSB,MSA),VLOOKUP(LEFT(A115,1),Teams,4,FALSE),FALSE))","v":""},{"$f":"IF(A115=\"\",\"\",VLOOKUP(LEFT(A115,1),Teams,2,FALSE))","v":""},null,2,null,"","","","","",null,null,null,"Discus"]
[null,"5",{"$f":"IF(A116=\"\",\"\",VLOOKUP($A111,IF(LEN(A116)=2,MSB,MSA),VLOOKUP(LEFT(A116,1),Teams,4,FALSE),FALSE))","v":""},{"$f":"IF(A116=\"\",\"\",VLOOKUP(LEFT(A116,1),Teams,2,FALSE))","v":""},null,1,null,"","","","","",{"$f":"15-SUM(H112:L116)","v":10},null,null,"Discus"]
["JT",null,"Boys' A Javelin",null,null,null,null,null,null,null,null,null,null,"JTA"]
["L","1",{"$f":"IF(A118=\"\",\"\",VLOOKUP($A117,IF(LEN(A118)=2,MSB,MSA),VLOOKUP(LEFT(A118,1),Teams,4,FALSE),FALSE))","v":"Harry Carr"},{"$f":"IF(A118=\"\",\"\",VLOOKUP(LEFT(A118,1),Teams,2,FALSE))","v":"Lewes"},"27.84",5,null,{"$f":"IF($A118=\"\",\"\",IF(LEFT($A118,1)=H$9,$F118,\"\"))","v":""},"","",5,"",null,null,null,"Javelin"]
["B","2",{"$f":"IF(A119=\"\",\"\",VLOOKUP($A117,IF(LEN(A119)=2,MSB,MSA),VLOOKUP(LEFT(A119,1),Teams,4,FALSE),FALSE))","v":"Henry Davis"},{"$f":"IF(A119=\"\",\"\",VLOOKUP(LEFT(A119,1),Teams,2,FALSE))","v":"Brighton & Hove"},"27.42",4,null,4,"","","","",null,null,null,"Javelin"]
["E","3",{"$f":"IF(A120=\"\",\"\",VLOOKUP($A117,IF(LEN(A120)=2,MSB,MSA),VLOOKUP(LEFT(A120,1),Teams,4,FALSE),FALSE))","v":"Alex Field"},{"$f":"IF(A120=\"\",\"\",VLOOKUP(LEFT(A120,1),Teams,2,FALSE))","v":"Eastbourne Rovers"},"20.10",3,null,"",3,"","",""]
["P","4",{"$f":"IF(A121=\"\",\"\",VLOOKUP($A117,IF(LEN(A121)=2,MSB,MSA),VLOOKUP(LEFT(A121,1),Teams,4,FALSE),FALSE))","v":"Joel Luscombe"},{"$f":"IF(A121=\"\",\"\",VLOOKUP(LEFT(A121,1),Teams,2,FALSE))","v":"Phoenix"},"10.93",2,null,"","","","",2,null,null,null,"Javelin"]
[null,"5",{"$f":"IF(A122=\"\",\"\",VLOOKUP($A117,IF(LEN(A122)=2,MSB,MSA),VLOOKUP(LEFT(A122,1),Teams,4,FALSE),FALSE))","v":""},{"$f":"IF(A122=\"\",\"\",VLOOKUP(LEFT(A122,1),Teams,2,FALSE))","v":""},null,1,null,"","","","","",{"$f":"15-SUM(H118:L122)","v":1},null,null,"Javelin"]
["JT",null,"Boys' B Javelin",null,null,null,null,null,null,null,null,null,null,"JTB"]
["BB","1",{"$f":"IF(A124=\"\",\"\",VLOOKUP($A123,IF(LEN(A124)=2,MSB,MSA),VLOOKUP(LEFT(A124,1),Teams,4,FALSE),FALSE))","v":"Ben Neale"},{"$f":"IF(A124=\"\",\"\",VLOOKUP(LEFT(A124,1),Teams,2,FALSE))","v":"Brighton & Hove"},"22.10",5,null,{"$f":"IF($A124=\"\",\"\",IF(LEFT($A124,1)=H$9,$F124,\"\"))","v":5},"","","","",null,null,null,"Javelin"]
[null,"2",{"$f":"IF(A125=\"\",\"\",VLOOKUP($A123,IF(LEN(A125)=2,MSB,MSA),VLOOKUP(LEFT(A125,1),Teams,4,FALSE),FALSE))","v":""},{"$f":"IF(A125=\"\",\"\",VLOOKUP(LEFT(A125,1),Teams,2,FALSE))","v":""},null,4,null,"","","","","",null,null,null,"Javelin"]
[null,"3",{"$f":"IF(A126=\"\",\"\",VLOOKUP($A123,IF(LEN(A126)=2,MSB,MSA),VLOOKUP(LEFT(A126,1),Teams,4,FALSE),FALSE))","v":""},{"$f":"IF(A126=\"\",\"\",VLOOKUP(LEFT(A126,1),Teams,2,FALSE))","v":""},null,3,null,"","","","",""]
[null,"4",{"$f":"IF(A127=\"\",\"\",VLOOKUP($A123,IF(LEN(A127)=2,MSB,MSA),VLOOKUP(LEFT(A127,1),Teams,4,FALSE),FALSE))","v":""},{"$f":"IF(A127=\"\",\"\",VLOOKUP(LEFT(A127,1),Teams,2,FALSE))","v":""},null,2,null,"","","","","",null,null,null,"Javelin"]
[null,"5",{"$f":"IF(A128=\"\",\"\",VLOOKUP($A123,IF(LEN(A128)=2,MSB,MSA),VLOOKUP(LEFT(A128,1),Teams,4,FALSE),FALSE))","v":""},{"$f":"IF(A128=\"\",\"\",VLOOKUP(LEFT(A128,1),Teams,2,FALSE))","v":""},null,1,null,"","","","","",{"$f":"15-SUM(H124:L128)","v":10},null,null,"Javelin"]
["4x100",null,"Boys' 4x100m",null,null,null,null,null,null,null,null,null,null,"4x100"]
["B","1",{"$f":"IF(A130=\"\",\"\",VLOOKUP($A129,IF(LEN(A130)=2,MSB,MSA),VLOOKUP(LEFT(A130,1),Teams,4,FALSE),FALSE))","v":"Brighton & Hove"},{"$f":"IF(A130=\"\",\"\",VLOOKUP(LEFT(A130,1),Teams,2,FALSE))","v":"Brighton & Hove"},"57.7",5,null,{"$f":"IF($A130=\"\",\"\",IF(LEFT($A130,1)=H$9,$F130,\"\"))","v":5},"","","","",null,null,null,"4x100m"]
["E","2",{"$f":"IF(A131=\"\",\"\",VLOOKUP($A129,IF(LEN(A131)=2,MSB,MSA),VLOOKUP(LEFT(A131,1),Teams,4,FALSE),FALSE))","v":"Eastbourne Rovers"},{"$f":"IF(A131=\"\",\"\",VLOOKUP(LEFT(A131,1),Teams,2,FALSE))","v":"Eastbourne Rovers"},"58.9",4,null,"",4,"","","",null,null,null,"4x100m"]
["L","3",{"$f":"IF(A132=\"\",\"\",VLOOKUP($A129,IF(LEN(A132)=2,MSB,MSA),VLOOKUP(LEFT(A132,1),Teams,4,FALSE),FALSE))","v":"Lewes"},{"$f":"IF(A132=\"\",\"\",VLOOKUP(LEFT(A132,1),Teams,2,FALSE))","v":"Lewes"},"60.6",3,null,"","","",3,""]
["P","4",{"$f":"IF(A133=\"\",\"\",VLOOKUP($A129,IF(LEN(A133)=2,MSB,MSA),VLOOKUP(LEFT(A133,1),Teams,4,FALSE),FALSE))","v":"Phoenix"},{"$f":"IF(A133=\"\",\"\",VLOOKUP(LEFT(A133,1),Teams,2,FALSE))","v":"Phoenix"},"60.6",2,null,"","","","",2,null,null,null,"4x100m"]
[null,"5",{"$f":"IF(A134=\"\",\"\",VLOOKUP($A129,IF(LEN(A134)=2,MSB,MSA),VLOOKUP(LEFT(A134,1),Teams,4,FALSE),FALSE))","v":""},{"$f":"IF(A134=\"\",\"\",VLOOKUP(LEFT(A134,1),Teams,2,FALSE))","v":""},null,1,null,"","","","","",{"$f":"15-SUM(H130:L134)","v":1},null,null,"4x100m"]
["75",null,"Girls' A 75m",null,null,null,null,null,null,null,null,null,null,"75A"]
["B",1,{"$f":"IF(A136=\"\",\"\",VLOOKUP($A135,IF(LEN(A136)=2,WSB,WSA),VLOOKUP(LEFT(A136,1),Teams,4,FALSE),FALSE))","v":"Talusa Gascoine"},{"$f":"IF(A136=\"\",\"\",VLOOKUP(LEFT(A136,1),Teams,2,FALSE))","v":"Brighton & Hove"},"10.8",5,null,{"$f":"IF($A136=\"\",\"\",IF(LEFT($A136,1)=H$9,$F136,\"\"))","v":5},"","","","",null,null,null,"100m"]
["P",2,{"$f":"IF(A137=\"\",\"\",VLOOKUP($A135,IF(LEN(A137)=2,WSB,WSA),VLOOKUP(LEFT(A137,1),Teams,4,FALSE),FALSE))","v":"Naomi Owalobi"},{"$f":"IF(A137=\"\",\"\",VLOOKUP(LEFT(A137,1),Teams,2,FALSE))","v":"Phoenix"},"10.8",4,null,"","","","",4,null,null,null,"100m"]
["E","3",{"$f":"IF(A138=\"\",\"\",VLOOKUP($A135,IF(LEN(A138)=2,WSB,WSA),VLOOKUP(LEFT(A138,1),Teams,4,FALSE),FALSE))","v":"Emma Logan"},{"$f":"IF(A138=\"\",\"\",VLOOKUP(LEFT(A138,1),Teams,2,FALSE))","v":"Eastbourne Rovers"},"11.8",3,null,"",3,"","",""]
["L","4",{"$f":"IF(A139=\"\",\"\",VLOOKUP($A135,IF(LEN(A139)=2,WSB,WSA),VLOOKUP(LEFT(A139,1),Teams,4,FALSE),FALSE))","v":"Eva Johnston Ellis"},{"$f":"IF(A139=\"\",\"\",VLOOKUP(LEFT(A139,1),Teams,2,FALSE))","v":"Lewes"},"12.0",2,null,"","","",2,"",null,null,null,"100m"]
[null,"5",{"$f":"IF(A140=\"\",\"\",VLOOKUP($A135,IF(LEN(A140)=2,WSB,WSA),VLOOKUP(LEFT(A140,1),Teams,4,FALSE),FALSE))","v":""},{"$f":"IF(A140=\"\",\"\",VLOOKUP(LEFT(A140,1),Teams,2,FALSE))","v":""},null,1,null,"","","","","",{"$f":"15-SUM(H136:L140)","v":1},null,null,"100m"]
["75",null,"Girls' B 75m",null,null,null,null,null,null,null,null,null,null,"75B"]
["BB",1,{"$f":"IF(A142=\"\",\"\",VLOOKUP($A141,IF(LEN(A142)=2,WSB,WSA),VLOOKUP(LEFT(A142,1),Teams,4,FALSE),FALSE))","v":"Lottie Wright"},{"$f":"IF(A142=\"\",\"\",VLOOKUP(LEFT(A142,1),Teams,2,FALSE))","v":"Brighton & Hove"},"11.7",5,null,{"$f":"IF($A142=\"\",\"\",IF(LEFT($A142,1)=H$9,$F142,\"\"))","v":5},"","","","",null,null,null,"100m"]
["PP",2,{"$f":"IF(A143=\"\",\"\",VLOOKUP($A141,IF(LEN(A143)=2,WSB,WSA),VLOOKUP(LEFT(A143,1),Teams,4,FALSE),FALSE))","v":"Connie Haines"},{"$f":"IF(A143=\"\",\"\",VLOOKUP(LEFT(A143,1),Teams,2,FALSE))","v":"Phoenix"},"12.2",4,null,"","","","",4,null,null,null,"100m"]
["EE","3",{"$f":"IF(A144=\"\",\"\",VLOOKUP($A141,IF(LEN(A144)=2,WSB,WSA),VLOOKUP(LEFT(A144,1),Teams,4,FALSE),FALSE))","v":"Emelia Davis"},{"$f":"IF(A144=\"\",\"\",VLOOKUP(LEFT(A144,1),Teams,2,FALSE))","v":"Eastbourne Rovers"},"13.0",3,null,"",3,"","",""]
[null,"4",{"$f":"IF(A145=\"\",\"\",VLOOKUP($A141,IF(LEN(A145)=2,WSB,WSA),VLOOKUP(LEFT(A145,1),Teams,4,FALSE),FALSE))","v":""},{"$f":"IF(A145=\"\",\"\",VLOOKUP(LEFT(A145,1),Teams,2,FALSE))","v":""},null,2,null,"","","","","",null,null,null,"100m"]
[null,"5",{"$f":"IF(A146=\"\",\"\",VLOOKUP($A141,IF(LEN(A146)=2,WSB,WSA),VLOOKUP(LEFT(A146,1),Teams,4,FALSE),FALSE))","v":""},{"$f":"IF(A146=\"\",\"\",VLOOKUP(LEFT(A146,1),Teams,2,FALSE))","v":""},null,1,null,"","","","","",{"$f":"15-SUM(H142:L146)","v":3},null,null,"100m"]
["150",null,"Girls' A 150m",null,null,null,null,null,null,null,null,null,null,"150A"]
["B",1,{"$f":"IF(A148=\"\",\"\",VLOOKUP($A147,IF(LEN(A148)=2,WSB,WSA),VLOOKUP(LEFT(A148,1),Teams,4,FALSE),FALSE))","v":"Talusa Gascoine"},{"$f":"IF(A148=\"\",\"\",VLOOKUP(LEFT(A148,1),Teams,2,FALSE))","v":"Brighton & Hove"},"21.3",5,null,{"$f":"IF($A148=\"\",\"\",IF(LEFT($A148,1)=H$9,$F148,\"\"))","v":5},"","","","",null,null,null,"200m"]
["L",2,{"$f":"IF(A149=\"\",\"\",VLOOKUP($A147,IF(LEN(A149)=2,WSB,WSA),VLOOKUP(LEFT(A149,1),Teams,4,FALSE),FALSE))","v":"Hannah Williams"},{"$f":"IF(A149=\"\",\"\",VLOOKUP(LEFT(A149,1),Teams,2,FALSE))","v":"Lewes"},"22.6",4,null,"","","",4,"",null,null,null,"200m"]
["E","3",{"$f":"IF(A150=\"\",\"\",VLOOKUP($A147,IF(LEN(A150)=2,WSB,WSA),VLOOKUP(LEFT(A150,1),Teams,4,FALSE),FALSE))","v":"Mia O'Hara"},{"$f":"IF(A150=\"\",\"\",VLOOKUP(LEFT(A150,1),Teams,2,FALSE))","v":"Eastbourne Rovers"},"23.3",3,null,"",3,"","",""]
["P","4",{"$f":"IF(A151=\"\",\"\",VLOOKUP($A147,IF(LEN(A151)=2,WSB,WSA),VLOOKUP(LEFT(A151,1),Teams,4,FALSE),FALSE))","v":"Francesca White"},{"$f":"IF(A151=\"\",\"\",VLOOKUP(LEFT(A151,1),Teams,2,FALSE))","v":"Phoenix"},"24.2",2,null,"","","","",2,null,null,null,"200m"]
[null,"5",{"$f":"IF(A152=\"\",\"\",VLOOKUP($A147,IF(LEN(A152)=2,WSB,WSA),VLOOKUP(LEFT(A152,1),Teams,4,FALSE),FALSE))","v":""},{"$f":"IF(A152=\"\",\"\",VLOOKUP(LEFT(A152,1),Teams,2,FALSE))","v":""},null,1,null,"","","","","",{"$f":"15-SUM(H148:L152)","v":1},null,null,"200m"]
["150",null,"Girls' B 150m",null,null,null,null,null,null,null,null,null,null,"150B"]
["BB",1,{"$f":"IF(A154=\"\",\"\",VLOOKUP($A153,IF(LEN(A154)=2,WSB,WSA),VLOOKUP(LEFT(A154,1),Teams,4,FALSE),FALSE))","v":"Verity Miller-Sarahs"},{"$f":"IF(A154=\"\",\"\",VLOOKUP(LEFT(A154,1),Teams,2,FALSE))","v":"Brighton & Hove"},"22.4",5,null,{"$f":"IF($A154=\"\",\"\",IF(LEFT($A154,1)=H$9,$F154,\"\"))","v":5},"","","","",null,null,null,"200m"]
["EE",2,{"$f":"IF(A155=\"\",\"\",VLOOKUP($A153,IF(LEN(A155)=2,WSB,WSA),VLOOKUP(LEFT(A155,1),Teams,4,FALSE),FALSE))","v":"Rose-Ella Peapell"},{"$f":"IF(A155=\"\",\"\",VLOOKUP(LEFT(A155,1),Teams,2,FALSE))","v":"Eastbourne Rovers"},"23.6",4,null,"",4,"","","",null,null,null,"200m"]
["PP","3",{"$f":"IF(A156=\"\",\"\",VLOOKUP($A153,IF(LEN(A156)=2,WSB,WSA),VLOOKUP(LEFT(A156,1),Teams,4,FALSE),FALSE))","v":"Olivia Aung"},{"$f":"IF(A156=\"\",\"\",VLOOKUP(LEFT(A156,1),Teams,2,FALSE))","v":"Phoenix"},"23.7",3,null,"","","","",3]
["LL","4",{"$f":"IF(A157=\"\",\"\",VLOOKUP($A153,IF(LEN(A157)=2,WSB,WSA),VLOOKUP(LEFT(A157,1),Teams,4,FALSE),FALSE))","v":"Chloe Kornivall"},{"$f":"IF(A157=\"\",\"\",VLOOKUP(LEFT(A157,1),Teams,2,FALSE))","v":"Lewes"},"24.1",2,null,"","","",2,"",null,null,null,"200m"]
[null,"5",{"$f":"IF(A158=\"\",\"\",VLOOKUP($A153,IF(LEN(A158)=2,WSB,WSA),VLOOKUP(LEFT(A158,1),Teams,4,FALSE),FALSE))","v":""},{"$f":"IF(A158=\"\",\"\",VLOOKUP(LEFT(A158,1),Teams,2,FALSE))","v":""},null,1,null,"","","","","",{"$f":"15-SUM(H154:L158)","v":1},null,null,"200m"]
["600",null,"Girls' A 600m",null,null,null,null,null,null,null,null,null,null,"600A"]
["P",1,{"$f":"IF(A160=\"\",\"\",VLOOKUP($A159,IF(LEN(A160)=2,WSB,WSA),VLOOKUP(LEFT(A160,1),Teams,4,FALSE),FALSE))","v":"Saoirse McGuiness"},{"$f":"IF(A160=\"\",\"\",VLOOKUP(LEFT(A160,1),Teams,2,FALSE))","v":"Phoenix"},"1:53.1",5,null,{"$f":"IF($A160=\"\",\"\",IF(LEFT($A160,1)=H$9,$F160,\"\"))","v":""},"","","",5,null,null,null,"400m"]
["EE",2,{"$f":"IF(A161=\"\",\"\",VLOOKUP($A159,IF(LEN(A161)=2,WSB,WSA),VLOOKUP(LEFT(A161,1),Teams,4,FALSE),FALSE))","v":"Chloe Eyres"},{"$f":"IF(A161=\"\",\"\",VLOOKUP(LEFT(A161,1),Teams,2,FALSE))","v":"Eastbourne Rovers"},"1:59.1",4,null,"",4,"","","",null,null,null,"400m"]
["B","3",{"$f":"IF(A162=\"\",\"\",VLOOKUP($A159,IF(LEN(A162)=2,WSB,WSA),VLOOKUP(LEFT(A162,1),Teams,4,FALSE),FALSE))","v":"Katie Mehel"},{"$f":"IF(A162=\"\",\"\",VLOOKUP(LEFT(A162,1),Teams,2,FALSE))","v":"Brighton & Hove"},"2:00.5",3,null,3,"","","",""]
["L","4",{"$f":"IF(A163=\"\",\"\",VLOOKUP($A159,IF(LEN(A163)=2,WSB,WSA),VLOOKUP(LEFT(A163,1),Teams,4,FALSE),FALSE))","v":"Chloe Kornivall"},{"$f":"IF(A163=\"\",\"\",VLOOKUP(LEFT(A163,1),Teams,2,FALSE))","v":"Lewes"},"2:04.2",2,null,"","","",2,"",null,null,null,"400m"]
[null,"5",{"$f":"IF(A164=\"\",\"\",VLOOKUP($A159,IF(LEN(A164)=2,WSB,WSA),VLOOKUP(LEFT(A164,1),Teams,4,FALSE),FALSE))","v":""},{"$f":"IF(A164=\"\",\"\",VLOOKUP(LEFT(A164,1),Teams,2,FALSE))","v":""},null,1,null,"","","","","",{"$f":"15-SUM(H160:L164)","v":1},null,null,"400m"]
["600",null,"Girls' B 600m",null,null,null,null,null,null,null,null,null,null,"600B"]
["E",1,{"$f":"IF(A166=\"\",\"\",VLOOKUP($A165,IF(LEN(A166)=2,WSB,WSA),VLOOKUP(LEFT(A166,1),Teams,4,FALSE),FALSE))","v":"Dafina Xhogu"},{"$f":"IF(A166=\"\",\"\",VLOOKUP(LEFT(A166,1),Teams,2,FALSE))","v":"Eastbourne Rovers"},"2:03.4",5,null,{"$f":"IF($A166=\"\",\"\",IF(LEFT($A166,1)=H$9,$F166,\"\"))","v":""},5,"","","",null,null,null,"400m"]
["PP",2,{"$f":"IF(A167=\"\",\"\",VLOOKUP($A165,IF(LEN(A167)=2,WSB,WSA),VLOOKUP(LEFT(A167,1),Teams,4,FALSE),FALSE))","v":"Alanah Harding"},{"$f":"IF(A167=\"\",\"\",VLOOKUP(LEFT(A167,1),Teams,2,FALSE))","v":"Phoenix"},"2:17.7",4,null,"","","","",4,null,null,null,"400m"]
["LL","3",{"$f":"IF(A168=\"\",\"\",VLOOKUP($A165,IF(LEN(A168)=2,WSB,WSA),VLOOKUP(LEFT(A168,1),Teams,4,FALSE),FALSE))","v":"Rosie Hobbs"},{"$f":"IF(A168=\"\",\"\",VLOOKUP(LEFT(A168,1),Teams,2,FALSE))","v":"Lewes"},"2:19.6",3,null,"","","",3,""]
[null,"4",{"$f":"IF(A169=\"\",\"\",VLOOKUP($A165,IF(LEN(A169)=2,WSB,WSA),VLOOKUP(LEFT(A169,1),Teams,4,FALSE),FALSE))","v":""},{"$f":"IF(A169=\"\",\"\",VLOOKUP(LEFT(A169,1),Teams,2,FALSE))","v":""},null,2,null,"","","","","",null,null,null,"400m"]
[null,"5",{"$f":"IF(A170=\"\",\"\",VLOOKUP($A165,IF(LEN(A170)=2,WSB,WSA),VLOOKUP(LEFT(A170,1),Teams,4,FALSE),FALSE))","v":""},{"$f":"IF(A170=\"\",\"\",VLOOKUP(LEFT(A170,1),Teams,2,FALSE))","v":""},null,1,null,"","","","","",{"$f":"15-SUM(H166:L170)","v":3},null,null,"400m"]
["1000",null,"Girls' A 1000m",null,null,null,null,null,null,null,null,null,null,"1000A"]
["LL",1,{"$f":"IF(A172=\"\",\"\",VLOOKUP($A171,IF(LEN(A172)=2,WSB,WSA),VLOOKUP(LEFT(A172,1),Teams,4,FALSE),FALSE))","v":"Rosie Gainsford"},{"$f":"IF(A172=\"\",\"\",VLOOKUP(LEFT(A172,1),Teams,2,FALSE))","v":"Lewes"},"3:22.8",5,null,{"$f":"IF($A172=\"\",\"\",IF(LEFT($A172,1)=H$9,$F172,\"\"))","v":""},"","",5,"",null,null,null,"800m"]
["B",2,{"$f":"IF(A173=\"\",\"\",VLOOKUP($A171,IF(LEN(A173)=2,WSB,WSA),VLOOKUP(LEFT(A173,1),Teams,4,FALSE),FALSE))","v":"Niami Halloren"},{"$f":"IF(A173=\"\",\"\",VLOOKUP(LEFT(A173,1),Teams,2,FALSE))","v":"Brighton & Hove"},"3:34.3",4,null,4,"","","","",null,null,null,"800m"]
["P","3",{"$f":"IF(A174=\"\",\"\",VLOOKUP($A171,IF(LEN(A174)=2,WSB,WSA),VLOOKUP(LEFT(A174,1),Teams,4,FALSE),FALSE))","v":"Rachel Berry"},{"$f":"IF(A174=\"\",\"\",VLOOKUP(LEFT(A174,1),Teams,2,FALSE))","v":"Phoenix"},"3:54.1",3,null,"","","","",3]
["EE","4",{"$f":"IF(A175=\"\",\"\",VLOOKUP($A171,IF(LEN(A175)=2,WSB,WSA),VLOOKUP(LEFT(A175,1),Teams,4,FALSE),FALSE))","v":"Dafina Xhogu"},{"$f":"IF(A175=\"\",\"\",VLOOKUP(LEFT(A175,1),Teams,2,FALSE))","v":"Eastbourne Rovers"},"3:57.0",2,null,"",2,"","","",null,null,null,"800m"]
[null,"5",{"$f":"IF(A176=\"\",\"\",VLOOKUP($A171,IF(LEN(A176)=2,WSB,WSA),VLOOKUP(LEFT(A176,1),Teams,4,FALSE),FALSE))","v":""},{"$f":"IF(A176=\"\",\"\",VLOOKUP(LEFT(A176,1),Teams,2,FALSE))","v":""},null,1,null,"","","","","",{"$f":"15-SUM(H172:L176)","v":1},null,null,"800m"]
["1000",null,"Girls' B 1000m",null,null,null,null,null,null,null,null,null,null,"1000B"]
["L",1,{"$f":"IF(A178=\"\",\"\",VLOOKUP($A177,IF(LEN(A178)=2,WSB,WSA),VLOOKUP(LEFT(A178,1),Teams,4,FALSE),FALSE))","v":"Eva Johnston Ellis"},{"$f":"IF(A178=\"\",\"\",VLOOKUP(LEFT(A178,1),Teams,2,FALSE))","v":"Lewes"},"3:35.2",5,null,{"$f":"IF($A178=\"\",\"\",IF(LEFT($A178,1)=H$9,$F178,\"\"))","v":""},"","",5,"",null,null,null,"800m"]
["E",2,{"$f":"IF(A179=\"\",\"\",VLOOKUP($A177,IF(LEN(A179)=2,WSB,WSA),VLOOKUP(LEFT(A179,1),Teams,4,FALSE),FALSE))","v":"Louise Mariana-McIntyre"},{"$f":"IF(A179=\"\",\"\",VLOOKUP(LEFT(A179,1),Teams,2,FALSE))","v":"Eastbourne Rovers"},"4:01.9",4,null,"",4,"","","",null,null,null,"800m"]
[null,"3",{"$f":"IF(A180=\"\",\"\",VLOOKUP($A177,IF(LEN(A180)=2,WSB,WSA),VLOOKUP(LEFT(A180,1),Teams,4,FALSE),FALSE))","v":""},{"$f":"IF(A180=\"\",\"\",VLOOKUP(LEFT(A180,1),Teams,2,FALSE))","v":""},null,3,null,"","","","",""]
[null,"4",{"$f":"IF(A181=\"\",\"\",VLOOKUP($A177,IF(LEN(A181)=2,WSB,WSA),VLOOKUP(LEFT(A181,1),Teams,4,FALSE),FALSE))","v":""},{"$f":"IF(A181=\"\",\"\",VLOOKUP(LEFT(A181,1),Teams,2,FALSE))","v":""},null,2,null,"","","","","",null,null,null,"800m"]
[null,"5",{"$f":"IF(A182=\"\",\"\",VLOOKUP($A177,IF(LEN(A182)=2,WSB,WSA),VLOOKUP(LEFT(A182,1),Teams,4,FALSE),FALSE))","v":""},{"$f":"IF(A182=\"\",\"\",VLOOKUP(LEFT(A182,1),Teams,2,FALSE))","v":""},null,1,null,"","","","","",{"$f":"15-SUM(H178:L182)","v":6},null,null,"800m"]
["70H",null,"Girls' A 70mH",null,null,null,null,null,null,null,null,null,null,"70HA"]
["B",1,{"$f":"IF(A184=\"\",\"\",VLOOKUP($A183,IF(LEN(A184)=2,WSB,WSA),VLOOKUP(LEFT(A184,1),Teams,4,FALSE),FALSE))","v":"Florence Robinson"},{"$f":"IF(A184=\"\",\"\",VLOOKUP(LEFT(A184,1),Teams,2,FALSE))","v":"Brighton & Hove"},"12.9",5,null,{"$f":"IF($A184=\"\",\"\",IF(LEFT($A184,1)=H$9,$F184,\"\"))","v":5},"","","","",null,null,null,"100mH"]
["E",2,{"$f":"IF(A185=\"\",\"\",VLOOKUP($A183,IF(LEN(A185)=2,WSB,WSA),VLOOKUP(LEFT(A185,1),Teams,4,FALSE),FALSE))","v":"Beth Hawkins"},{"$f":"IF(A185=\"\",\"\",VLOOKUP(LEFT(A185,1),Teams,2,FALSE))","v":"Eastbourne Rovers"},"14.1",4,null,"",4,"","","",null,null,null,"100mH"]
["PP","3",{"$f":"IF(A186=\"\",\"\",VLOOKUP($A183,IF(LEN(A186)=2,WSB,WSA),VLOOKUP(LEFT(A186,1),Teams,4,FALSE),FALSE))","v":"Tegan Corder"},{"$f":"IF(A186=\"\",\"\",VLOOKUP(LEFT(A186,1),Teams,2,FALSE))","v":"Phoenix"},"15.7",3,null,"","","","",3]
[null,"4",{"$f":"IF(A187=\"\",\"\",VLOOKUP($A183,IF(LEN(A187)=2,WSB,WSA),VLOOKUP(LEFT(A187,1),Teams,4,FALSE),FALSE))","v":""},{"$f":"IF(A187=\"\",\"\",VLOOKUP(LEFT(A187,1),Teams,2,FALSE))","v":""},null,2,null,"","","","","",null,null,null,"100mH"]
[null,"5",{"$f":"IF(A188=\"\",\"\",VLOOKUP($A183,IF(LEN(A188)=2,WSB,WSA),VLOOKUP(LEFT(A188,1),Teams,4,FALSE),FALSE))","v":""},{"$f":"IF(A188=\"\",\"\",VLOOKUP(LEFT(A188,1),Teams,2,FALSE))","v":""},null,1,null,"","","","","",{"$f":"15-SUM(H184:L188)","v":3},null,null,"100mH"]
["70H",null,"Girls' B 70mH",null,null,null,null,null,null,null,null,null,null,"70HB"]
["P",1,{"$f":"IF(A190=\"\",\"\",VLOOKUP($A189,IF(LEN(A190)=2,WSB,WSA),VLOOKUP(LEFT(A190,1),Teams,4,FALSE),FALSE))","v":"Rachel Berry"},{"$f":"IF(A190=\"\",\"\",VLOOKUP(LEFT(A190,1),Teams,2,FALSE))","v":"Phoenix"},"19.2",5,null,{"$f":"IF($A190=\"\",\"\",IF(LEFT($A190,1)=H$9,$F190,\"\"))","v":""},"","","",5,null,null,null,"100mH"]
[null,2,{"$f":"IF(A191=\"\",\"\",VLOOKUP($A189,IF(LEN(A191)=2,WSB,WSA),VLOOKUP(LEFT(A191,1),Teams,4,FALSE),FALSE))","v":""},{"$f":"IF(A191=\"\",\"\",VLOOKUP(LEFT(A191,1),Teams,2,FALSE))","v":""},null,4,null,"","","","","",null,null,null,"100mH"]
[null,"3",{"$f":"IF(A192=\"\",\"\",VLOOKUP($A189,IF(LEN(A192)=2,WSB,WSA),VLOOKUP(LEFT(A192,1),Teams,4,FALSE),FALSE))","v":""},{"$f":"IF(A192=\"\",\"\",VLOOKUP(LEFT(A192,1),Teams,2,FALSE))","v":""},null,3,null,"","","","",""]
[null,"4",{"$f":"IF(A193=\"\",\"\",VLOOKUP($A189,IF(LEN(A193)=2,WSB,WSA),VLOOKUP(LEFT(A193,1),Teams,4,FALSE),FALSE))","v":""},{"$f":"IF(A193=\"\",\"\",VLOOKUP(LEFT(A193,1),Teams,2,FALSE))","v":""},null,2,null,"","","","","",null,null,null,"100mH"]
[null,"5",{"$f":"IF(A194=\"\",\"\",VLOOKUP($A189,IF(LEN(A194)=2,WSB,WSA),VLOOKUP(LEFT(A194,1),Teams,4,FALSE),FALSE))","v":""},{"$f":"IF(A194=\"\",\"\",VLOOKUP(LEFT(A194,1),Teams,2,FALSE))","v":""},null,1,null,"","","","","",{"$f":"15-SUM(H190:L194)","v":10},null,null,"100mH"]
["HJ",null,"Girls' A High Jump",null,null,null,null,null,null,null,null,null,null,"HJA"]
["P",1,{"$f":"IF(A196=\"\",\"\",VLOOKUP($A195,IF(LEN(A196)=2,WSB,WSA),VLOOKUP(LEFT(A196,1),Teams,4,FALSE),FALSE))","v":"Connie Haines"},{"$f":"IF(A196=\"\",\"\",VLOOKUP(LEFT(A196,1),Teams,2,FALSE))","v":"Phoenix"},"1.20",5,null,{"$f":"IF($A196=\"\",\"\",IF(LEFT($A196,1)=H$9,$F196,\"\"))","v":""},"","","",5,null,null,null,"High Jump"]
["L","2=",{"$f":"IF(A197=\"\",\"\",VLOOKUP($A195,IF(LEN(A197)=2,WSB,WSA),VLOOKUP(LEFT(A197,1),Teams,4,FALSE),FALSE))","v":"Olivia Bartholomew"},{"$f":"IF(A197=\"\",\"\",VLOOKUP(LEFT(A197,1),Teams,2,FALSE))","v":"Lewes"},"1.15",3.5,null,"","","",3.5,"",null,null,null,"High Jump"]
["B","2=",{"$f":"IF(A198=\"\",\"\",VLOOKUP($A195,IF(LEN(A198)=2,WSB,WSA),VLOOKUP(LEFT(A198,1),Teams,4,FALSE),FALSE))","v":"Katie Mehel"},{"$f":"IF(A198=\"\",\"\",VLOOKUP(LEFT(A198,1),Teams,2,FALSE))","v":"Brighton & Hove"},"1.15",3.5,null,3.5,"","","",""]
["E","4",{"$f":"IF(A199=\"\",\"\",VLOOKUP($A195,IF(LEN(A199)=2,WSB,WSA),VLOOKUP(LEFT(A199,1),Teams,4,FALSE),FALSE))","v":"Emma Logan"},{"$f":"IF(A199=\"\",\"\",VLOOKUP(LEFT(A199,1),Teams,2,FALSE))","v":"Eastbourne Rovers"},"1.15",2,null,"",2,"","","",null,null,null,"High Jump"]
[null,"5",{"$f":"IF(A200=\"\",\"\",VLOOKUP($A195,IF(LEN(A200)=2,WSB,WSA),VLOOKUP(LEFT(A200,1),Teams,4,FALSE),FALSE))","v":""},{"$f":"IF(A200=\"\",\"\",VLOOKUP(LEFT(A200,1),Teams,2,FALSE))","v":""},null,1,null,"","","","","",{"$f":"15-SUM(H196:L200)","v":1},null,null,"High Jump"]
["HJ",null,"Girls' B High Jump",null,null,null,null,null,null,null,null,null,null,"HJB"]
["EE",1,{"$f":"IF(A202=\"\",\"\",VLOOKUP($A201,IF(LEN(A202)=2,WSB,WSA),VLOOKUP(LEFT(A202,1),Teams,4,FALSE),FALSE))","v":"Chloe Morman"},{"$f":"IF(A202=\"\",\"\",VLOOKUP(LEFT(A202,1),Teams,2,FALSE))","v":"Eastbourne Rovers"},"1.00",5,null,{"$f":"IF($A202=\"\",\"\",IF(LEFT($A202,1)=H$9,$F202,\"\"))","v":""},5,"","","",null,null,null,"High Jump"]
["LL",2,{"$f":"IF(A203=\"\",\"\",VLOOKUP($A201,IF(LEN(A203)=2,WSB,WSA),VLOOKUP(LEFT(A203,1),Teams,4,FALSE),FALSE))","v":"Rosie Hobbs"},{"$f":"IF(A203=\"\",\"\",VLOOKUP(LEFT(A203,1),Teams,2,FALSE))","v":"Lewes"},"1.00",4,null,"","","",4,"",null,null,null,"High Jump"]
[null,"3",{"$f":"IF(A204=\"\",\"\",VLOOKUP($A201,IF(LEN(A204)=2,WSB,WSA),VLOOKUP(LEFT(A204,1),Teams,4,FALSE),FALSE))","v":""},{"$f":"IF(A204=\"\",\"\",VLOOKUP(LEFT(A204,1),Teams,2,FALSE))","v":""},null,3,null,"","","","",""]
[null,"4",{"$f":"IF(A205=\"\",\"\",VLOOKUP($A201,IF(LEN(A205)=2,WSB,WSA),VLOOKUP(LEFT(A205,1),Teams,4,FALSE),FALSE))","v":""},{"$f":"IF(A205=\"\",\"\",VLOOKUP(LEFT(A205,1),Teams,2,FALSE))","v":""},null,2,null,"","","","","",null,null,null,"High Jump"]
[null,"5",{"$f":"IF(A206=\"\",\"\",VLOOKUP($A201,IF(LEN(A206)=2,WSB,WSA),VLOOKUP(LEFT(A206,1),Teams,4,FALSE),FALSE))","v":""},{"$f":"IF(A206=\"\",\"\",VLOOKUP(LEFT(A206,1),Teams,2,FALSE))","v":""},null,1,null,"","","","","",{"$f":"15-SUM(H202:L206)","v":6},null,null,"High Jump"]
["LJ",null,"Girls' A Long Jump",null,null,null,null,null,null,null,null,null,null,"LJA"]
["B",1,{"$f":"IF(A208=\"\",\"\",VLOOKUP($A207,IF(LEN(A208)=2,WSB,WSA),VLOOKUP(LEFT(A208,1),Teams,4,FALSE),FALSE))","v":"Anna Dornbusch"},{"$f":"IF(A208=\"\",\"\",VLOOKUP(LEFT(A208,1),Teams,2,FALSE))","v":"Brighton & Hove"},"3.85",5,null,{"$f":"IF($A208=\"\",\"\",IF(LEFT($A208,1)=H$9,$F208,\"\"))","v":5},"","","","",null,null,null,"Long Jump"]
["E",2,{"$f":"IF(A209=\"\",\"\",VLOOKUP($A207,IF(LEN(A209)=2,WSB,WSA),VLOOKUP(LEFT(A209,1),Teams,4,FALSE),FALSE))","v":"Mia O'Hara"},{"$f":"IF(A209=\"\",\"\",VLOOKUP(LEFT(A209,1),Teams,2,FALSE))","v":"Eastbourne Rovers"},"3.65",4,null,"",4,"","","",null,null,null,"Long Jump"]
["P","3",{"$f":"IF(A210=\"\",\"\",VLOOKUP($A207,IF(LEN(A210)=2,WSB,WSA),VLOOKUP(LEFT(A210,1),Teams,4,FALSE),FALSE))","v":"Francesca White"},{"$f":"IF(A210=\"\",\"\",VLOOKUP(LEFT(A210,1),Teams,2,FALSE))","v":"Phoenix"},"3.64",3,null,"","","","",3]
["L","4",{"$f":"IF(A211=\"\",\"\",VLOOKUP($A207,IF(LEN(A211)=2,WSB,WSA),VLOOKUP(LEFT(A211,1),Teams,4,FALSE),FALSE))","v":"Olivia Bartholomew"},{"$f":"IF(A211=\"\",\"\",VLOOKUP(LEFT(A211,1),Teams,2,FALSE))","v":"Lewes"},"3.60",2,null,"","","",2,"",null,null,null,"Long Jump"]
[null,"5",{"$f":"IF(A212=\"\",\"\",VLOOKUP($A207,IF(LEN(A212)=2,WSB,WSA),VLOOKUP(LEFT(A212,1),Teams,4,FALSE),FALSE))","v":""},{"$f":"IF(A212=\"\",\"\",VLOOKUP(LEFT(A212,1),Teams,2,FALSE))","v":""},null,1,null,"","","","","",{"$f":"15-SUM(H208:L212)","v":1},null,null,"Long Jump"]
["LJ",null,"Girls' B Long Jump",null,null,null,null,null,null,null,null,null,null,"LJB"]
["PP",1,{"$f":"IF(A214=\"\",\"\",VLOOKUP($A213,IF(LEN(A214)=2,WSB,WSA),VLOOKUP(LEFT(A214,1),Teams,4,FALSE),FALSE))","v":"Ella Hodge"},{"$f":"IF(A214=\"\",\"\",VLOOKUP(LEFT(A214,1),Teams,2,FALSE))","v":"Phoenix"},"3.63",5,null,{"$f":"IF($A214=\"\",\"\",IF(LEFT($A214,1)=H$9,$F214,\"\"))","v":""},"","","",5,null,null,null,"Long Jump"]
["BB",2,{"$f":"IF(A215=\"\",\"\",VLOOKUP($A213,IF(LEN(A215)=2,WSB,WSA),VLOOKUP(LEFT(A215,1),Teams,4,FALSE),FALSE))","v":"Verity Miller-Sarahs"},{"$f":"IF(A215=\"\",\"\",VLOOKUP(LEFT(A215,1),Teams,2,FALSE))","v":"Brighton & Hove"},"3.45",4,null,4,"","","","",null,null,null,"Long Jump"]
["EE","3",{"$f":"IF(A216=\"\",\"\",VLOOKUP($A213,IF(LEN(A216)=2,WSB,WSA),VLOOKUP(LEFT(A216,1),Teams,4,FALSE),FALSE))","v":"Molly Swingler"},{"$f":"IF(A216=\"\",\"\",VLOOKUP(LEFT(A216,1),Teams,2,FALSE))","v":"Eastbourne Rovers"},"3.27",3,null,"",3,"","",""]
["LL","4",{"$f":"IF(A217=\"\",\"\",VLOOKUP($A213,IF(LEN(A217)=2,WSB,WSA),VLOOKUP(LEFT(A217,1),Teams,4,FALSE),FALSE))","v":"Isabella Williams"},{"$f":"IF(A217=\"\",\"\",VLOOKUP(LEFT(A217,1),Teams,2,FALSE))","v":"Lewes"},"3.15",2,null,"","","",2,"",null,null,null,"Long Jump"]
[null,"5",{"$f":"IF(A218=\"\",\"\",VLOOKUP($A213,IF(LEN(A218)=2,WSB,WSA),VLOOKUP(LEFT(A218,1),Teams,4,FALSE),FALSE))","v":""},{"$f":"IF(A218=\"\",\"\",VLOOKUP(LEFT(A218,1),Teams,2,FALSE))","v":""},null,1,null,"","","","","",{"$f":"15-SUM(H214:L218)","v":1},null,null,"Long Jump"]
["SP",null,"Girls' A Shot Putt",null,null,null,null,null,null,null,null,null,null,"SPA"]
["P",1,{"$f":"IF(A220=\"\",\"\",VLOOKUP($A219,IF(LEN(A220)=2,WSB,WSA),VLOOKUP(LEFT(A220,1),Teams,4,FALSE),FALSE))","v":"Naomi Owalobi"},{"$f":"IF(A220=\"\",\"\",VLOOKUP(LEFT(A220,1),Teams,2,FALSE))","v":"Phoenix"},"7.63",5,null,{"$f":"IF($A220=\"\",\"\",IF(LEFT($A220,1)=H$9,$F220,\"\"))","v":""},"","","",5,null,null,null,"Shot"]
["BB",2,{"$f":"IF(A221=\"\",\"\",VLOOKUP($A219,IF(LEN(A221)=2,WSB,WSA),VLOOKUP(LEFT(A221,1),Teams,4,FALSE),FALSE))","v":"Mollie Kichenside"},{"$f":"IF(A221=\"\",\"\",VLOOKUP(LEFT(A221,1),Teams,2,FALSE))","v":"Brighton & Hove"},"6.97",4,null,4,"","","","",null,null,null,"Shot"]
["E","3",{"$f":"IF(A222=\"\",\"\",VLOOKUP($A219,IF(LEN(A222)=2,WSB,WSA),VLOOKUP(LEFT(A222,1),Teams,4,FALSE),FALSE))","v":"Louise Mariana-McIntyre"},{"$f":"IF(A222=\"\",\"\",VLOOKUP(LEFT(A222,1),Teams,2,FALSE))","v":"Eastbourne Rovers"},"4.23",3,null,"",3,"","",""]
[null,"4",{"$f":"IF(A223=\"\",\"\",VLOOKUP($A219,IF(LEN(A223)=2,WSB,WSA),VLOOKUP(LEFT(A223,1),Teams,4,FALSE),FALSE))","v":""},{"$f":"IF(A223=\"\",\"\",VLOOKUP(LEFT(A223,1),Teams,2,FALSE))","v":""},null,2,null,"","","","","",null,null,null,"Shot"]
[null,"5",{"$f":"IF(A224=\"\",\"\",VLOOKUP($A219,IF(LEN(A224)=2,WSB,WSA),VLOOKUP(LEFT(A224,1),Teams,4,FALSE),FALSE))","v":""},{"$f":"IF(A224=\"\",\"\",VLOOKUP(LEFT(A224,1),Teams,2,FALSE))","v":""},null,1,null,"","","","","",{"$f":"15-SUM(H220:L224)","v":3},null,null,"Shot"]
["SP",null,"Girls' B Shot Putt",null,null,null,null,null,null,null,null,null,null,"SPB"]
["B",1,{"$f":"IF(A226=\"\",\"\",VLOOKUP($A225,IF(LEN(A226)=2,WSB,WSA),VLOOKUP(LEFT(A226,1),Teams,4,FALSE),FALSE))","v":"Anna Dornbusch"},{"$f":"IF(A226=\"\",\"\",VLOOKUP(LEFT(A226,1),Teams,2,FALSE))","v":"Brighton & Hove"},"5.51",5,null,{"$f":"IF($A226=\"\",\"\",IF(LEFT($A226,1)=H$9,$F226,\"\"))","v":5},"","","","",null,null,null,"Shot"]
["PP",2,{"$f":"IF(A227=\"\",\"\",VLOOKUP($A225,IF(LEN(A227)=2,WSB,WSA),VLOOKUP(LEFT(A227,1),Teams,4,FALSE),FALSE))","v":"Alanah Harding"},{"$f":"IF(A227=\"\",\"\",VLOOKUP(LEFT(A227,1),Teams,2,FALSE))","v":"Phoenix"},"5.08",4,null,"","","","",4,null,null,null,"Shot"]
[null,"3",{"$f":"IF(A228=\"\",\"\",VLOOKUP($A225,IF(LEN(A228)=2,WSB,WSA),VLOOKUP(LEFT(A228,1),Teams,4,FALSE),FALSE))","v":""},{"$f":"IF(A228=\"\",\"\",VLOOKUP(LEFT(A228,1),Teams,2,FALSE))","v":""},null,3,null,"","","","",""]
[null,"4",{"$f":"IF(A229=\"\",\"\",VLOOKUP($A225,IF(LEN(A229)=2,WSB,WSA),VLOOKUP(LEFT(A229,1),Teams,4,FALSE),FALSE))","v":""},{"$f":"IF(A229=\"\",\"\",VLOOKUP(LEFT(A229,1),Teams,2,FALSE))","v":""},null,2,null,"","","","","",null,null,null,"Shot"]
[null,"5",{"$f":"IF(A230=\"\",\"\",VLOOKUP($A225,IF(LEN(A230)=2,WSB,WSA),VLOOKUP(LEFT(A230,1),Teams,4,FALSE),FALSE))","v":""},{"$f":"IF(A230=\"\",\"\",VLOOKUP(LEFT(A230,1),Teams,2,FALSE))","v":""},null,1,null,"","","","","",{"$f":"15-SUM(H226:L230)","v":6},null,null,"Shot"]
["DT",null,"Girls' A Discus",null,null,null,null,null,null,null,null,null,null,"DTA"]
["B",1,{"$f":"IF(A232=\"\",\"\",VLOOKUP($A231,IF(LEN(A232)=2,WSB,WSA),VLOOKUP(LEFT(A232,1),Teams,4,FALSE),FALSE))","v":"Mollie Kichenside"},{"$f":"IF(A232=\"\",\"\",VLOOKUP(LEFT(A232,1),Teams,2,FALSE))","v":"Brighton & Hove"},"20.84",5,null,{"$f":"IF($A232=\"\",\"\",IF(LEFT($A232,1)=H$9,$F232,\"\"))","v":5},"","","","",null,null,null,"Discus"]
["E",2,{"$f":"IF(A233=\"\",\"\",VLOOKUP($A231,IF(LEN(A233)=2,WSB,WSA),VLOOKUP(LEFT(A233,1),Teams,4,FALSE),FALSE))","v":"Nellie Hannam"},{"$f":"IF(A233=\"\",\"\",VLOOKUP(LEFT(A233,1),Teams,2,FALSE))","v":"Eastbourne Rovers"},"17.79",4,null,"",4,"","","",null,null,null,"Discus"]
["P","3",{"$f":"IF(A234=\"\",\"\",VLOOKUP($A231,IF(LEN(A234)=2,WSB,WSA),VLOOKUP(LEFT(A234,1),Teams,4,FALSE),FALSE))","v":"Coleen Shaw"},{"$f":"IF(A234=\"\",\"\",VLOOKUP(LEFT(A234,1),Teams,2,FALSE))","v":"Phoenix"},"10.12",3,null,"","","","",3]
["L","4",{"$f":"IF(A235=\"\",\"\",VLOOKUP($A231,IF(LEN(A235)=2,WSB,WSA),VLOOKUP(LEFT(A235,1),Teams,4,FALSE),FALSE))","v":"Scarlett Bullen"},{"$f":"IF(A235=\"\",\"\",VLOOKUP(LEFT(A235,1),Teams,2,FALSE))","v":"Lewes"},"9.09",2,null,"","","",2,"",null,null,null,"Discus"]
[null,"5",{"$f":"IF(A236=\"\",\"\",VLOOKUP($A231,IF(LEN(A236)=2,WSB,WSA),VLOOKUP(LEFT(A236,1),Teams,4,FALSE),FALSE))","v":""},{"$f":"IF(A236=\"\",\"\",VLOOKUP(LEFT(A236,1),Teams,2,FALSE))","v":""},null,1,null,"","","","","",{"$f":"15-SUM(H232:L236)","v":1},null,null,"Discus"]
["DT",null,"Girls' B Discus",null,null,null,null,null,null,null,null,null,null,"DTB"]
["BB",1,{"$f":"IF(A238=\"\",\"\",VLOOKUP($A237,IF(LEN(A238)=2,WSB,WSA),VLOOKUP(LEFT(A238,1),Teams,4,FALSE),FALSE))","v":"Lottie Wright"},{"$f":"IF(A238=\"\",\"\",VLOOKUP(LEFT(A238,1),Teams,2,FALSE))","v":"Brighton & Hove"},"14.55",5,null,{"$f":"IF($A238=\"\",\"\",IF(LEFT($A238,1)=H$9,$F238,\"\"))","v":5},"","","","",null,null,null,"Discus"]
["EE",2,{"$f":"IF(A239=\"\",\"\",VLOOKUP($A237,IF(LEN(A239)=2,WSB,WSA),VLOOKUP(LEFT(A239,1),Teams,4,FALSE),FALSE))","v":"Molly Swingler"},{"$f":"IF(A239=\"\",\"\",VLOOKUP(LEFT(A239,1),Teams,2,FALSE))","v":"Eastbourne Rovers"},"12.77",4,null,"",4,"","","",null,null,null,"Discus"]
[null,"3",{"$f":"IF(A240=\"\",\"\",VLOOKUP($A237,IF(LEN(A240)=2,WSB,WSA),VLOOKUP(LEFT(A240,1),Teams,4,FALSE),FALSE))","v":""},{"$f":"IF(A240=\"\",\"\",VLOOKUP(LEFT(A240,1),Teams,2,FALSE))","v":""},null,3,null,"","","","",""]
[null,"4",{"$f":"IF(A241=\"\",\"\",VLOOKUP($A237,IF(LEN(A241)=2,WSB,WSA),VLOOKUP(LEFT(A241,1),Teams,4,FALSE),FALSE))","v":""},{"$f":"IF(A241=\"\",\"\",VLOOKUP(LEFT(A241,1),Teams,2,FALSE))","v":""},null,2,null,"","","","","",null,null,null,"Discus"]
[null,"5",{"$f":"IF(A242=\"\",\"\",VLOOKUP($A237,IF(LEN(A242)=2,WSB,WSA),VLOOKUP(LEFT(A242,1),Teams,4,FALSE),FALSE))","v":""},{"$f":"IF(A242=\"\",\"\",VLOOKUP(LEFT(A242,1),Teams,2,FALSE))","v":""},null,1,null,"","","","","",{"$f":"15-SUM(H238:L242)","v":6},null,null,"Discus"]
["JT",null,"Girls' A Javelin",null,null,null,null,null,null,null,null,null,null,"JTA"]
["L",1,{"$f":"IF(A244=\"\",\"\",VLOOKUP($A243,IF(LEN(A244)=2,WSB,WSA),VLOOKUP(LEFT(A244,1),Teams,4,FALSE),FALSE))","v":"Hannah Williams"},{"$f":"IF(A244=\"\",\"\",VLOOKUP(LEFT(A244,1),Teams,2,FALSE))","v":"Lewes"},"25.05",5,null,{"$f":"IF($A244=\"\",\"\",IF(LEFT($A244,1)=H$9,$F244,\"\"))","v":""},"","",5,"",null,null,null,"Javelin"]
["B",2,{"$f":"IF(A245=\"\",\"\",VLOOKUP($A243,IF(LEN(A245)=2,WSB,WSA),VLOOKUP(LEFT(A245,1),Teams,4,FALSE),FALSE))","v":"Florence Robinson"},{"$f":"IF(A245=\"\",\"\",VLOOKUP(LEFT(A245,1),Teams,2,FALSE))","v":"Brighton & Hove"},"24.67",4,null,4,"","","","",null,null,null,"Javelin"]
["EE","3",{"$f":"IF(A246=\"\",\"\",VLOOKUP($A243,IF(LEN(A246)=2,WSB,WSA),VLOOKUP(LEFT(A246,1),Teams,4,FALSE),FALSE))","v":"Nellie Hannam"},{"$f":"IF(A246=\"\",\"\",VLOOKUP(LEFT(A246,1),Teams,2,FALSE))","v":"Eastbourne Rovers"},"14.85",3,null,"",3,"","",""]
["PP","4",{"$f":"IF(A247=\"\",\"\",VLOOKUP($A243,IF(LEN(A247)=2,WSB,WSA),VLOOKUP(LEFT(A247,1),Teams,4,FALSE),FALSE))","v":"Olivia Aung"},{"$f":"IF(A247=\"\",\"\",VLOOKUP(LEFT(A247,1),Teams,2,FALSE))","v":"Phoenix"},"12.13",2,null,"","","","",2,null,null,null,"Javelin"]
[null,"5",{"$f":"IF(A248=\"\",\"\",VLOOKUP($A243,IF(LEN(A248)=2,WSB,WSA),VLOOKUP(LEFT(A248,1),Teams,4,FALSE),FALSE))","v":""},{"$f":"IF(A248=\"\",\"\",VLOOKUP(LEFT(A248,1),Teams,2,FALSE))","v":""},null,1,null,"","","","","",{"$f":"15-SUM(H244:L248)","v":1},null,null,"Javelin"]
["JT",null,"Girls' B Javelin",null,null,null,null,null,null,null,null,null,null,"JTB"]
["LL",1,{"$f":"IF(A250=\"\",\"\",VLOOKUP($A249,IF(LEN(A250)=2,WSB,WSA),VLOOKUP(LEFT(A250,1),Teams,4,FALSE),FALSE))","v":"Rosie Gainsford"},{"$f":"IF(A250=\"\",\"\",VLOOKUP(LEFT(A250,1),Teams,2,FALSE))","v":"Lewes"},"17.72",5,null,{"$f":"IF($A250=\"\",\"\",IF(LEFT($A250,1)=H$9,$F250,\"\"))","v":""},"","",5,"",null,null,null,"Javelin"]
["E",2,{"$f":"IF(A251=\"\",\"\",VLOOKUP($A249,IF(LEN(A251)=2,WSB,WSA),VLOOKUP(LEFT(A251,1),Teams,4,FALSE),FALSE))","v":"Beth Hawkins"},{"$f":"IF(A251=\"\",\"\",VLOOKUP(LEFT(A251,1),Teams,2,FALSE))","v":"Eastbourne Rovers"},"13.52",4,null,"",4,"","","",null,null,null,"Javelin"]
["BB","3",{"$f":"IF(A252=\"\",\"\",VLOOKUP($A249,IF(LEN(A252)=2,WSB,WSA),VLOOKUP(LEFT(A252,1),Teams,4,FALSE),FALSE))","v":"Niamh Halloen"},{"$f":"IF(A252=\"\",\"\",VLOOKUP(LEFT(A252,1),Teams,2,FALSE))","v":"Brighton & Hove"},"12.92",3,null,3,"","","",""]
["P","4",{"$f":"IF(A253=\"\",\"\",VLOOKUP($A249,IF(LEN(A253)=2,WSB,WSA),VLOOKUP(LEFT(A253,1),Teams,4,FALSE),FALSE))","v":"Coleen Shaw"},{"$f":"IF(A253=\"\",\"\",VLOOKUP(LEFT(A253,1),Teams,2,FALSE))","v":"Phoenix"},"11.11",2,null,"","","","",2,null,null,null,"Javelin"]
[null,"5",{"$f":"IF(A254=\"\",\"\",VLOOKUP($A249,IF(LEN(A254)=2,WSB,WSA),VLOOKUP(LEFT(A254,1),Teams,4,FALSE),FALSE))","v":""},{"$f":"IF(A254=\"\",\"\",VLOOKUP(LEFT(A254,1),Teams,2,FALSE))","v":""},null,1,null,"","","","","",{"$f":"15-SUM(H250:L254)","v":1},null,null,"Javelin"]
["4x100",null,"Girls' 4x100m",null,null,null,null,null,null,null,null,null,null,"4x100"]
["B",1,{"$f":"IF(A256=\"\",\"\",VLOOKUP($A255,IF(LEN(A256)=2,WSB,WSA),VLOOKUP(LEFT(A256,1),Teams,4,FALSE),FALSE))","v":"Brighton & Hove"},{"$f":"IF(A256=\"\",\"\",VLOOKUP(LEFT(A256,1),Teams,2,FALSE))","v":"Brighton & Hove"},"58.5",5,null,{"$f":"IF($A256=\"\",\"\",IF(LEFT($A256,1)=H$9,$F256,\"\"))","v":5},"","","","",null,null,null,"4x100m"]
["P",2,{"$f":"IF(A257=\"\",\"\",VLOOKUP($A255,IF(LEN(A257)=2,WSB,WSA),VLOOKUP(LEFT(A257,1),Teams,4,FALSE),FALSE))","v":"Phoenix"},{"$f":"IF(A257=\"\",\"\",VLOOKUP(LEFT(A257,1),Teams,2,FALSE))","v":"Phoenix"},"61.1",4,null,"","","","",4,null,null,null,"4x100m"]
["E","3",{"$f":"IF(A258=\"\",\"\",VLOOKUP($A255,IF(LEN(A258)=2,WSB,WSA),VLOOKUP(LEFT(A258,1),Teams,4,FALSE),FALSE))","v":"Eastbourne Rovers"},{"$f":"IF(A258=\"\",\"\",VLOOKUP(LEFT(A258,1),Teams,2,FALSE))","v":"Eastbourne Rovers"},"61.1",3,null,"",3,"","",""]
["L","4",{"$f":"IF(A259=\"\",\"\",VLOOKUP($A255,IF(LEN(A259)=2,WSB,WSA),VLOOKUP(LEFT(A259,1),Teams,4,FALSE),FALSE))","v":"Lewes"},{"$f":"IF(A259=\"\",\"\",VLOOKUP(LEFT(A259,1),Teams,2,FALSE))","v":"Lewes"},"62.0",2,null,"","","",2,"",null,null,null,"4x100m"]
[null,"5",{"$f":"IF(A260=\"\",\"\",VLOOKUP($A255,IF(LEN(A260)=2,WSB,WSA),VLOOKUP(LEFT(A260,1),Teams,4,FALSE),FALSE))","v":""},{"$f":"IF(A260=\"\",\"\",VLOOKUP(LEFT(A260,1),Teams,2,FALSE))","v":""},null,1,null,"","","","","",{"$f":"15-SUM(H256:L260)","v":1},null,null,"4x100m"]
[null,null,null,null,null,null,null,{"$f":"SUM(H10:H260)","v":169},104.5,0,105.5,125,126]

{"sheet":"print","index":2,"n_rows":262,"n_cols":5,"rows_kept":262,"cut":false,"hidden":false,"merged":[]}
[{"$f":"Dec!B1","v":"Sussex Under 13 League 2014 - East Division - Match 3 - 23.7.14"}]
[]
[]
[]
[]
[]
[]
[]
[]
[]
[]
[]
[]
[]
[]
[]
[]
[]
[]
[]
[]
[]
[]
[2,"Arthur Haines","Phoenix","23.1",4]
["3","Samuel Culbert","Brighton & Hove","23.6",3]
["4","Huxley Pearce","Eastbourne Rovers","23.8",2]
["5","","",null,1]
[null,"Boys' A 600m"]
[1,"Jamie Arnold","Brighton & Hove","1:48.2",5]
[2,"Alex Brothwell","Phoenix","1:50.2",4]
["3","Atticus Dubouny","Lewes","1:55.0",3]
["4","James Ward","Eastbourne Rovers","2:07.0",2]
["5","","",null,1]
[null,"Boys' B 600m"]
[1,"Adam Firsht","Brighton & Hove","1:50.4",5]
[2,"Eimhin Wellings","Phoenix","2:01.1",4]
["3","Dexter Scott","Eastbourne Rovers","2:10.9",3]
["4","Louis Soudain","Lewes","2:13.0",2]
["5","","",null,1]
[null,"Boys' A 1000m"]
[1,"Finn Halloren","Brighton & Hove","3:13.3",5]
[2,"Jooel Luscombe","Phoenix","3:22.9",4]
["3","Jay Atkins","Lewes","3:28.8",3]
["4","William Napier","Eastbourne Rovers","3:49.3",2]
["5","","",null,1]
[null,"Boys' B 1000m"]
["1","Lucas Losh","Brighton & Hove","3:28.4",5]
["2","Sam Horn","Lewes","3:32.1",4]
["3","Zach Elbourne","Phoenix","3:33.9",3]
["4","","",null,2]
["5","","",null,1]
[null,"Boys' A 75mH"]
["1","Finn Halloren","Brighton & Hove","14.4",5]
["2","Remy Corder","Phoenix","14.7",4]
["3","Cassian Young","Lewes","16.0",3]
["4","","",null,2]
["5","","",null,1]
[null,"Boys' B 75mH"]
["1","Adam Firsht","Brighton & Hove","15.6",5]
["2","Hector Blanchard","Phoenix","15.7",4]
["3","","",null,3]
["4","","",null,2]
["5","","",null,1]
[null,"Boys' A High Jump"]
["1","Harry Reinicker Found","Lewes","1.47",5]
["2","William Saunders","Phoenix","1.44",4]
["3=","Luke McCallum","Brighton & Hove","1.2",2.5]
["3=","Joel Newton","Eastbourne Rovers","1.2",2.5]
["5","","",null,1]
[null,"Boys' B High Jump"]
["1","Jay Atkins","Lewes","1.25",5]
["2","Zach Elbourne","Phoenix","1.15",4]
["3","Lucas Losh","Brighton & Hove","1.15",3]
["4","","",null,2]
["5","","",null,1]
[null,"Boys' A Long Jump"]
["1","William Saunders","Phoenix","4.56",5]
["2","Danny Ross-Horton","Brighton & Hove","4.27",4]
["3","Harry Reinicker Found","Lewes","3.78",3]
["4","Luc Crisp","Eastbourne Rovers","3.50",2]
["5","","",null,1]
[null,"Boys' B Long Jump"]
["1","Arthur Haines","Phoenix","4.08",5]
["2","Cameron Nash","Brighton & Hove","4.03",4]
["3","Harry Carr","Lewes","3.59",3]
["4","Dexter Scott","Eastbourne Rovers","3.37",2]
["5","","",null,1]
[null,"Boys' A Shot Putt"]
["1","Henry Davis","Brighton & Hove","6.24",5]
["2","Huxley Pearce","Eastbourne Rovers","5.78",4]
["3","Hector Blanchard","Phoenix","5.29",3]
["4","Louis Soudain","Lewes","4.31",2]
["5","","",null,1]
[null,"Boys' B Shot Putt"]
["1","Thomas Routledge","Brighton & Hove","6.17",5]
["2","","",null,4]
["3","","",null,3]
["4","","",null,2]
["5","","",null,1]
[null,"Boys' A Discus"]
["1","Thomas Routledge","Brighton & Hove","14.99",5]
["2","","",null,4]
["3","","",null,3]
["4","","",null,2]
["5","","",null,1]
[null,"Boys' B Discus"]
["1","Marc Kenneally","Brighton & Hove","13.58",5]
["2","","",null,4]
["3","","",null,3]
["4","","",null,2]
["5","","",null,1]
[null,"Boys' A Javelin"]
["1","Harry Carr","Lewes","27.84",5]
["2","Henry Davis","Brighton & Hove","27.42",4]
["3","Alex Field","Eastbourne Rovers","20.10",3]
["4","Joel Luscombe","Phoenix","10.93",2]
["5","","",null,1]
[null,"Boys' B Javelin"]
["1","Ben Neale","Brighton & Hove","22.10",5]
["2","","",null,4]
["3","","",null,3]
["4","","",null,2]
["5","","",null,1]
[null,"Boys' 4x100m"]
["1","Brighton & Hove","Brighton & Hove","57.7",5]
["2","Eastbourne Rovers","Eastbourne Rovers","58.9",4]
["3","Lewes","Lewes","60.6",3]
["4","Phoenix","Phoenix","60.6",2]
["5","","",null,1]
[null,"Girls' A 75m"]
[1,"Talusa Gascoine","Brighton & Hove","10.8",5]
[2,"Naomi Owalobi","Phoenix","10.8",4]
["3","Emma Logan","Eastbourne Rovers","11.8",3]
["4","Eva Johnston Ellis","Lewes","12.0",2]
["5","","",null,1]
[null,"Girls' B 75m"]
[1,"Lottie Wright","Brighton & Hove","11.7",5]
[2,"Connie Haines","Phoenix","12.2",4]
["3","Emelia Davis","Eastbourne Rovers","13.0",3]
["4","","",null,2]
["5","","",null,1]
[null,"Girls' A 150m"]
[1,"Talusa Gascoine","Brighton & Hove","21.3",5]
[2,"Hannah Williams","Lewes","22.6",4]
["3","Mia O'Hara","Eastbourne Rovers","23.3",3]
["4","Francesca White","Phoenix","24.2",2]
["5","","",null,1]
[null,"Girls' B 150m"]
[1,"Verity Miller-Sarahs","Brighton & Hove","22.4",5]
[2,"Rose-Ella Peapell","Eastbourne Rovers","23.6",4]
["3","Olivia Aung","Phoenix","23.7",3]
["4","Chloe Kornivall","Lewes","24.1",2]
["5","","",null,1]
[null,"Girls' A 600m"]
[1,"Saoirse McGuiness","Phoenix","1:53.1",5]
[2,"Chloe Eyres","Eastbourne Rovers","1:59.1",4]
["3","Katie Mehel","Brighton & Hove","2:00.5",3]
["4","Chloe Kornivall","Lewes","2:04.2",2]
["5","","",null,1]
[null,"Girls' B 600m"]
[1,"Dafina Xhogu","Eastbourne Rovers","2:03.4",5]
[2,"Alanah Harding","Phoenix","2:17.7",4]
["3","Rosie Hobbs","Lewes","2:19.6",3]
["4","","",null,2]
["5","","",null,1]
[null,"Girls' A 1000m"]
[1,"Rosie Gainsford","Lewes","3:22.8",5]
[2,"Niami Halloren","Brighton & Hove","3:34.3",4]
["3","Rachel Berry","Phoenix","3:54.1",3]
["4","Dafina Xhogu","Eastbourne Rovers","3:57.0",2]
["5","","",null,1]
[null,"Girls' B 1000m"]
[1,"Eva Johnston Ellis","Lewes","3:35.2",5]
[2,"Louise Mariana-McIntyre","Eastbourne Rovers","4:01.9",4]
["3","","",null,3]
["4","","",null,2]
["5","","",null,1]
[null,"Girls' A 70mH"]
[1,"Florence Robinson","Brighton & Hove","12.9",5]
[2,"Beth Hawkins","Eastbourne Rovers","14.1",4]
["3","Tegan Corder","Phoenix","15.7",3]
["4","","",null,2]
["5","","",null,1]
[null,"Girls' B 70mH"]
[1,"Rachel Berry","Phoenix","19.2",5]
[2,"","",null,4]
["3","","",null,3]
["4","","",null,2]
["5","","",null,1]
[null,"Girls' A High Jump"]
[1,"Connie Haines","Phoenix","1.20",5]
["2=","Olivia Bartholomew","Lewes","1.15",3.5]
["2=","Katie Mehel","Brighton & Hove","1.15",3.5]
["4","Emma Logan","Eastbourne Rovers","1.15",2]
["5","","",null,1]
[null,"Girls' B High Jump"]
[1,"Chloe Morman","Eastbourne Rovers","1.00",5]
[2,"Rosie Hobbs","Lewes","1.00",4]
["3","","",null,3]
["4","","",null,2]
["5","","",null,1]
[null,"Girls' A Long Jump"]
[1,"Anna Dornbusch","Brighton & Hove","3.85",5]
[2,"Mia O'Hara","Eastbourne Rovers","3.65",4]
["3","Francesca White","Phoenix","3.64",3]
["4","Olivia Bartholomew","Lewes","3.60",2]
["5","","",null,1]
[null,"Girls' B Long Jump"]
[1,"Ella Hodge","Phoenix","3.63",5]
[2,"Verity Miller-Sarahs","Brighton & Hove","3.45",4]
["3","Molly Swingler","Eastbourne Rovers","3.27",3]
["4","Isabella Williams","Lewes","3.15",2]
["5","","",null,1]
[null,"Girls' A Shot Putt"]
[1,"Naomi Owalobi","Phoenix","7.63",5]
[2,"Mollie Kichenside","Brighton & Hove","6.97",4]
["3","Louise Mariana-McIntyre","Eastbourne Rovers","4.23",3]
["4","","",null,2]
["5","","",null,1]
[null,"Girls' B Shot Putt"]
[1,"Anna Dornbusch","Brighton & Hove","5.51",5]
[2,"Alanah Harding","Phoenix","5.08",4]
["3","","",null,3]
["4","","",null,2]
["5","","",null,1]
[null,"Girls' A Discus"]
[1,"Mollie Kichenside","Brighton & Hove","20.84",5]
[2,"Nellie Hannam","Eastbourne Rovers","17.79",4]
["3","Coleen Shaw","Phoenix","10.12",3]
["4","Scarlett Bullen","Lewes","9.09",2]
["5","","",null,1]
[null,"Girls' B Discus"]
[1,"Lottie Wright","Brighton & Hove","14.55",5]
[2,"Molly Swingler","Eastbourne Rovers","12.77",4]
["3","","",null,3]
["4","","",null,2]
["5","","",null,1]
[null,"Girls' A Javelin"]
[1,"Hannah Williams","Lewes","25.05",5]
[2,"Florence Robinson","Brighton & Hove","24.67",4]
["3","Nellie Hannam","Eastbourne Rovers","14.85",3]
["4","Olivia Aung","Phoenix","12.13",2]
["5","","",null,1]
[null,"Girls' B Javelin"]
[1,"Rosie Gainsford","Lewes","17.72",5]
[2,"Beth Hawkins","Eastbourne Rovers","13.52",4]
["3","Niamh Halloen","Brighton & Hove","12.92",3]
["4","Coleen Shaw","Phoenix","11.11",2]
["5","","",null,1]
[null,"Girls' 4x100m"]
[1,"Brighton & Hove","Brighton & Hove","58.5",5]
[2,"Phoenix","Phoenix","61.1",4]
["3","Eastbourne Rovers","Eastbourne Rovers","61.1",3]
["4","Lewes","Lewes","62.0",2]
["5","","",null,1]
["5","","",null,1]
[null,"Girls' 4x100m"]
[1,"Brighton & Hove","Brighton & Hove","58.5",5]
[2,"Phoenix","Phoenix","61.1",4]
["3","Eastbourne Rovers","Eastbourne Rovers","61.1",3]
["4","Lewes","Lewes","62.0",2]
["5","","",null,1]

{"sheet":"nonscoring","index":3,"n_rows":47,"n_cols":5,"rows_kept":47,"cut":false,"hidden":false,"merged":[]}
["Non-Scorers Sussex  u13 League  Match 3 Eastbourne 23.7.14"]
[null,null,null,{"$f":"Dec!B$3","v":"Brighton & Hove"}]
[null,null,null,{"$f":"Dec!B$4","v":"Eastbourne Rovers"}]
[null,null,null,{"$f":"Dec!B$5","v":"Hastings"}]
[null,null,null,{"$f":"Dec!B$6","v":"Lewes"}]
["Boys",null,"Non-scoring events",{"$f":"Dec!B$7","v":"Phoenix"}]
["Event","Pos","Name","Club","Perf."]
["75",null,"Samuel Culbert","Brighton & Hove","11.6"]
["75",null,"Jayden Vincent (u11)","Eastbourne Rovers","12.2"]
["600",null,"Luke McCullum","Brighton & Hove","1:59.1"]
["600",null,"Ben Neale","Brighton & Hove","2:03.7"]
["600",null,"Jonah Roeg","Brighton & Hove","2:04.4"]
["150",null,"Marc Keneally","Brighton & Hove","23.7"]
["4x100",null,null,"Brighton & Hove","60.7"]
[]
["Girls",null,"Non-scoring events"]
["Event","Pos","Name","Club","Perf."]
["JT",null,"Izzy Williams","Lewes",16.260000000000002]
["JT",null,"Amy Hobden","Eastbourne Rovers",10.28]
["LJ",null,"Cassie Brewer Wren","Phoenix",3.57]
["LJ",null,"Scarlett Bullen","Lewes",3.12]
["LJ",null,"Emelia Davis","Eastbourne Rovers",2.85]
["75",null,"Cassie Brewer Wren","Phoenix",11.6]
["75",null,"Emelia Davis","Eastbourne Rovers",12]
["75",null,"Shana Martlew","Eastbourne Rovers",11.6]
["75",null,"Ester Owolabi","Phoenix",12.6]
["75",null,"Beatrix Daley","Phoenix",12.8]
["75",null,"Rene Bassin","Phoenix",12.9]
["75",null,"Caitlin Knight (U15)","Eastbourne Rovers",11.6]
["75",null,"Tegan Copper","Phoenix",12.7]
["75",null,"Emily Muzio","Phoenix",13.1]
["75",null,"Ciara Muzio","Phoenix",13.7]
["600",null,"Morgan Tulley","Phoenix","2:05.0"]
["600",null,"Emily Muzio","Phoenix","2:10.5"]
["600",null,"Ciara Muzio","Phoenix","2:15.6"]
["600",null,"Amy Hobden","Eastbourne Rovers","2:15.9"]
["600",null,"Beatrix Daley","Phoenix","2:17.8"]
["600",null,"Rene Bassin","Phoenix","2:29.4"]
["600",null,"Ester Owolabi","Phoenix","2:54.0"]
["150",null,"Shana Martlew","Eastbourne Rovers","23.1"]
["SP",null,"Caitlin Knight (U15)","Eastbourne Rovers","6.68"]
["4x100",null,null,"Eastbourne Rovers","62.3"]
["4x100",null,null,"Phoenix","63.2"]
["4x100",null,null,"Brighton & Hove","62.2"]
["4x100",null,null,"Phoenix","65.8"]
["4x100",null,null,"Eastbourne Rovers","66.3"]
["4x100",null,null,"Phoenix","70.4"]